Package description for 'dovecot'

A secure IMAP server.

 Dovecot is an IMAP server whose major goals are security and extreme
 reliability. It uses index files to optimally store the mailbox state,
 which makes it very fast even with huge mailboxes. Indexes won't prevent
 external mailbox updates, so Dovecot is still fully compatible with
 standard Maildir and mbox formats. There's also a fully featured POP3
 server included.

Various other information for package 'dovecot'   (Repository 'blindcoder')

URL: http://www.dovecot.org/

Author: Timo Sirainen <tss@iki.fi>
Maintainer: Benjamin Schieder <blindcoder@scavenger.homeip.net>

License: GPL
Status: Beta
Version: 0.99.12

Download: http://www.dovecot.org/releases/ dovecot-0.99.12.tar.gz

Buildtime: 7082 (5) ERROR seconds (on reference hardware)
Buildtime: 7003 (9) ERROR seconds (on reference hardware)
Buildtime: 7028 (5) ERROR seconds (on reference hardware)
Buildtime: 6876 (9) ERROR seconds (on reference hardware)
Buildtime: 6887 (5) ERROR seconds (on reference hardware)
Buildtime: 6880 (9) ERROR seconds (on reference hardware)

ROCK Sources:  dovecot.cachedovecot.descdovecot.initgnutls-upd.patch

Error Logs

[5-ERROR] gcc-42 -DHAVE_CONFIG_H -I. -I. -I../.. -I../../src/lib 	-I../../src/lib-se
ttings 	-DAUTH_MODULE_DIR=\""/usr/lib/dovecot/auth"\" 	    -g -O2 -Wall -W -Wmissing-prot
otypes -Wmissing-declarations -Wpointer-arith -Wchar-subscripts -Wformat=2 -Wbad-function-
cast  -c passdb-passwd-file.c
[5-ERROR] gcc-42 -DHAVE_CONFIG_H -I. -I. -I../.. -I../../src/lib 	-I../../src/lib-se
ttings 	-DAUTH_MODULE_DIR=\""/usr/lib/dovecot/auth"\" 	    -g -O2 -Wall -W -Wmissing-prot
otypes -Wmissing-declarations -Wpointer-arith -Wchar-subscripts -Wformat=2 -Wbad-function-
cast  -c passdb-pam.c
[5-ERROR] gcc-42 -DHAVE_CONFIG_H -I. -I. -I../.. -I../../src/lib 	-I../../src/lib-se
ttings 	-DAUTH_MODULE_DIR=\""/usr/lib/dovecot/auth"\" 	    -g -O2 -Wall -W -Wmissing-prot
otypes -Wmissing-declarations -Wpointer-arith -Wchar-subscripts -Wformat=2 -Wbad-function-
cast  -c passdb-shadow.c
[5-ERROR] gcc-42 -DHAVE_CONFIG_H -I. -I. -I../.. -I../../src/lib 	-I../../src/lib-se
ttings 	-DAUTH_MODULE_DIR=\""/usr/lib/dovecot/auth"\" 	    -g -O2 -Wall -W -Wmissing-prot
otypes -Wmissing-declarations -Wpointer-arith -Wchar-subscripts -Wformat=2 -Wbad-function-
cast  -c passdb-vpopmail.c
[5-ERROR] gcc-42 -DHAVE_CONFIG_H -I. -I. -I../.. -I../../src/lib 	-I../../src/lib-se
ttings 	-DAUTH_MODULE_DIR=\""/usr/lib/dovecot/auth"\" 	    -g -O2 -Wall -W -Wmissing-prot
otypes -Wmissing-declarations -Wpointer-arith -Wchar-subscripts -Wformat=2 -Wbad-function-
cast  -c passdb-mysql.c
[5-ERROR] gcc-42 -DHAVE_CONFIG_H -I. -I. -I../.. -I../../src/lib 	-I../../src/lib-se
ttings 	-DAUTH_MODULE_DIR=\""/usr/lib/dovecot/auth"\" 	    -g -O2 -Wall -W -Wmissing-prot
otypes -Wmissing-declarations -Wpointer-arith -Wchar-subscripts -Wformat=2 -Wbad-function-
cast  -c passdb-pgsql.c
[5-ERROR] gcc-42 -DHAVE_CONFIG_H -I. -I. -I../.. -I../../src/lib 	-I../../src/lib-se
ttings 	-DAUTH_MODULE_DIR=\""/usr/lib/dovecot/auth"\" 	    -g -O2 -Wall -W -Wmissing-prot
otypes -Wmissing-declarations -Wpointer-arith -Wchar-subscripts -Wformat=2 -Wbad-function-
cast  -c password-scheme.c
[5-ERROR] password-scheme.c: In function 'password_verify':
[5-ERROR] password-scheme.c:55: warning: pointer targets in passing argument 1 of 'SHA1' d
iffer in signedness
[5-ERROR] gcc-42 -DHAVE_CONFIG_H -I. -I. -I../.. -I../../src/lib 	-I../../src/lib-se
ttings 	-DAUTH_MODULE_DIR=\""/usr/lib/dovecot/auth"\" 	    -g -O2 -Wall -W -Wmissing-prot
otypes -Wmissing-declarations -Wpointer-arith -Wchar-subscripts -Wformat=2 -Wbad-function-
cast  -c userdb.c
[5-ERROR] gcc-42 -DHAVE_CONFIG_H -I. -I. -I../.. -I../../src/lib 	-I../../src/lib-se
ttings 	-DAUTH_MODULE_DIR=\""/usr/lib/dovecot/auth"\" 	    -g -O2 -Wall -W -Wmissing-prot
otypes -Wmissing-declarations -Wpointer-arith -Wchar-subscripts -Wformat=2 -Wbad-function-
cast  -c userdb-ldap.c
[5-ERROR] gcc-42 -DHAVE_CONFIG_H -I. -I. -I../.. -I../../src/lib 	-I../../src/lib-se
ttings 	-DAUTH_MODULE_DIR=\""/usr/lib/dovecot/auth"\" 	    -g -O2 -Wall -W -Wmissing-prot
otypes -Wmissing-declarations -Wpointer-arith -Wchar-subscripts -Wformat=2 -Wbad-function-
cast  -c userdb-passwd.c
[5-ERROR] gcc-42 -DHAVE_CONFIG_H -I. -I. -I../.. -I../../src/lib 	-I../../src/lib-se
ttings 	-DAUTH_MODULE_DIR=\""/usr/lib/dovecot/auth"\" 	    -g -O2 -Wall -W -Wmissing-prot
otypes -Wmissing-declarations -Wpointer-arith -Wchar-subscripts -Wformat=2 -Wbad-function-
cast  -c userdb-passwd-file.c
[5-ERROR] gcc-42 -DHAVE_CONFIG_H -I. -I. -I../.. -I../../src/lib 	-I../../src/lib-se
ttings 	-DAUTH_MODULE_DIR=\""/usr/lib/dovecot/auth"\" 	    -g -O2 -Wall -W -Wmissing-prot
otypes -Wmissing-declarations -Wpointer-arith -Wchar-subscripts -Wformat=2 -Wbad-function-
cast  -c userdb-static.c
[5-ERROR] gcc-42 -DHAVE_CONFIG_H -I. -I. -I../.. -I../../src/lib 	-I../../src/lib-se
ttings 	-DAUTH_MODULE_DIR=\""/usr/lib/dovecot/auth"\" 	    -g -O2 -Wall -W -Wmissing-prot
otypes -Wmissing-declarations -Wpointer-arith -Wchar-subscripts -Wformat=2 -Wbad-function-
cast  -c userdb-vpopmail.c
[5-ERROR] gcc-42 -DHAVE_CONFIG_H -I. -I. -I../.. -I../../src/lib 	-I../../src/lib-se
ttings 	-DAUTH_MODULE_DIR=\""/usr/lib/dovecot/auth"\" 	    -g -O2 -Wall -W -Wmissing-prot
otypes -Wmissing-declarations -Wpointer-arith -Wchar-subscripts -Wformat=2 -Wbad-function-
cast  -c userdb-mysql.c
[5-ERROR] gcc-42 -DHAVE_CONFIG_H -I. -I. -I../.. -I../../src/lib 	-I../../src/lib-se
ttings 	-DAUTH_MODULE_DIR=\""/usr/lib/dovecot/auth"\" 	    -g -O2 -Wall -W -Wmissing-prot
otypes -Wmissing-declarations -Wpointer-arith -Wchar-subscripts -Wformat=2 -Wbad-function-
cast  -c userdb-pgsql.c
[5-ERROR] /bin/sh ../../libtool --mode=link gcc-42  -g -O2 -Wall -W -Wmissing-prototypes -
Wmissing-declarations -Wpointer-arith -Wchar-subscripts -Wformat=2 -Wbad-function-cast   -
o dovecot-auth  auth-module.o db-ldap.o db-mysql.o db-pgsql.o db-passwd-file.o login-conne
ction.o main.o master-connection.o md5crypt.o mech.o mech-anonymous.o mech-cyrus-sasl2.o m
ech-plain.o mech-digest-md5.o mycrypt.o passdb.o passdb-ldap.o passdb-passwd.o passdb-pass
wd-file.o passdb-pam.o passdb-shadow.o passdb-vpopmail.o passdb-mysql.o passdb-pgsql.o pas
sword-scheme.o userdb.o userdb-ldap.o userdb-passwd.o userdb-passwd-file.o userdb-static.o
 userdb-vpopmail.o userdb-mysql.o userdb-pgsql.o ../lib-settings/libsettings.a 	../lib/lib
lib.a 	-lcrypt -lcrypto -lpam 	 	-export-dynamic -ldl 
[5-ERROR] mkdir .libs
[5-ERROR] gcc-42 -g -O2 -Wall -W -Wmissing-prototypes -Wmissing-declarations -Wpointer-ari
th -Wchar-subscripts -Wformat=2 -Wbad-function-cast -o dovecot-auth auth-module.o db-ldap.
o db-mysql.o db-pgsql.o db-passwd-file.o login-connection.o main.o master-connection.o md5
crypt.o mech.o mech-anonymous.o mech-cyrus-sasl2.o mech-plain.o mech-digest-md5.o mycrypt.
o passdb.o passdb-ldap.o passdb-passwd.o passdb-passwd-file.o passdb-pam.o passdb-shadow.o
 passdb-vpopmail.o passdb-mysql.o passdb-pgsql.o password-scheme.o userdb.o userdb-ldap.o 
userdb-passwd.o userdb-passwd-file.o userdb-static.o userdb-vpopmail.o userdb-mysql.o user
db-pgsql.o -Wl,--export-dynamic  ../lib-settings/libsettings.a ../lib/liblib.a -lcrypt -lc
rypto /lib/libpam.so -ldl
[5-ERROR] make[3]: Leaving directory `/ROCK/loop/src.dovecot.1181950511.5023.4161569442/do
vecot-0.99.12/src/auth'
[5-ERROR] Making all in master
[5-ERROR] make[3]: Entering directory `/ROCK/loop/src.dovecot.1181950511.5023.4161569442/d
ovecot-0.99.12/src/master'
[5-ERROR] gcc-42 -DHAVE_CONFIG_H -I. -I. -I../.. -I../../src/lib 	-I../../src/lib-se
ttings 	-DSYSCONFDIR=\""/etc"\" 	-DPKG_RUNDIR=\""/var/run/dovecot"\" 	-DPKG_LIBE
XECDIR=\""/usr/libexec/dovecot"\" 	-DMODULEDIR=\""/usr/lib/dovecot"\" 	-DSSLDIR=\
""/etc/ssl\""    -g -O2 -Wall -W -Wmissing-prototypes -Wmissing-declarations -Wpointer-ari
th -Wchar-subscripts -Wformat=2 -Wbad-function-cast  -c auth-process.c
[5-ERROR] gcc-42 -DHAVE_CONFIG_H -I. -I. -I../.. -I../../src/lib 	-I../../src/lib-se
ttings 	-DSYSCONFDIR=\""/etc"\" 	-DPKG_RUNDIR=\""/var/run/dovecot"\" 	-DPKG_LIBE
XECDIR=\""/usr/libexec/dovecot"\" 	-DMODULEDIR=\""/usr/lib/dovecot"\" 	-DSSLDIR=\
""/etc/ssl\""    -g -O2 -Wall -W -Wmissing-prototypes -Wmissing-declarations -Wpointer-ari
th -Wchar-subscripts -Wformat=2 -Wbad-function-cast  -c login-process.c
[5-ERROR] gcc-42 -DHAVE_CONFIG_H -I. -I. -I../.. -I../../src/lib 	-I../../src/lib-se
ttings 	-DSYSCONFDIR=\""/etc"\" 	-DPKG_RUNDIR=\""/var/run/dovecot"\" 	-DPKG_LIBE
XECDIR=\""/usr/libexec/dovecot"\" 	-DMODULEDIR=\""/usr/lib/dovecot"\" 	-DSSLDIR=\
""/etc/ssl\""    -g -O2 -Wall -W -Wmissing-prototypes -Wmissing-declarations -Wpointer-ari
th -Wchar-subscripts -Wformat=2 -Wbad-function-cast  -c mail-process.c
[5-ERROR] gcc-42 -DHAVE_CONFIG_H -I. -I. -I../.. -I../../src/lib 	-I../../src/lib-se
ttings 	-DSYSCONFDIR=\""/etc"\" 	-DPKG_RUNDIR=\""/var/run/dovecot"\" 	-DPKG_LIBE
XECDIR=\""/usr/libexec/dovecot"\" 	-DMODULEDIR=\""/usr/lib/dovecot"\" 	-DSSLDIR=\
""/etc/ssl\""    -g -O2 -Wall -W -Wmissing-prototypes -Wmissing-declarations -Wpointer-ari
th -Wchar-subscripts -Wformat=2 -Wbad-function-cast  -c main.c
[5-ERROR] gcc-42 -DHAVE_CONFIG_H -I. -I. -I../.. -I../../src/lib 	-I../../src/lib-se
ttings 	-DSYSCONFDIR=\""/etc"\" 	-DPKG_RUNDIR=\""/var/run/dovecot"\" 	-DPKG_LIBE
XECDIR=\""/usr/libexec/dovecot"\" 	-DMODULEDIR=\""/usr/lib/dovecot"\" 	-DSSLDIR=\
""/etc/ssl\""    -g -O2 -Wall -W -Wmissing-prototypes -Wmissing-declarations -Wpointer-ari
th -Wchar-subscripts -Wformat=2 -Wbad-function-cast  -c master-settings.c
[5-ERROR] gcc-42 -DHAVE_CONFIG_H -I. -I. -I../.. -I../../src/lib 	-I../../src/lib-se
ttings 	-DSYSCONFDIR=\""/etc"\" 	-DPKG_RUNDIR=\""/var/run/dovecot"\" 	-DPKG_LIBE
XECDIR=\""/usr/libexec/dovecot"\" 	-DMODULEDIR=\""/usr/lib/dovecot"\" 	-DSSLDIR=\
""/etc/ssl\""    -g -O2 -Wall -W -Wmissing-prototypes -Wmissing-declarations -Wpointer-ari
th -Wchar-subscripts -Wformat=2 -Wbad-function-cast  -c ssl-init.c
[5-ERROR] gcc-42 -DHAVE_CONFIG_H -I. -I. -I../.. -I../../src/lib 	-I../../src/lib-se
ttings 	-DSYSCONFDIR=\""/etc"\" 	-DPKG_RUNDIR=\""/var/run/dovecot"\" 	-DPKG_LIBE
XECDIR=\""/usr/libexec/dovecot"\" 	-DMODULEDIR=\""/usr/lib/dovecot"\" 	-DSSLDIR=\
""/etc/ssl\""    -g -O2 -Wall -W -Wmissing-prototypes -Wmissing-declarations -Wpointer-ari
th -Wchar-subscripts -Wformat=2 -Wbad-function-cast  -c ssl-init-gnutls.c
[5-ERROR] ssl-init-gnutls.c: In function 'generate_dh_parameters':
[5-ERROR] ssl-init-gnutls.c:34: warning: implicit declaration of function 'gnutls_dh_param
s_generate'
[5-ERROR] ssl-init-gnutls.c: In function 'generate_rsa_parameters':
[5-ERROR] ssl-init-gnutls.c:57: warning: implicit declaration of function 'gnutls_rsa_para
ms_generate'
[5-ERROR] gcc-42 -DHAVE_CONFIG_H -I. -I. -I../.. -I../../src/lib 	-I../../src/lib-se
ttings 	-DSYSCONFDIR=\""/etc"\" 	-DPKG_RUNDIR=\""/var/run/dovecot"\" 	-DPKG_LIBE
XECDIR=\""/usr/libexec/dovecot"\" 	-DMODULEDIR=\""/usr/lib/dovecot"\" 	-DSSLDIR=\
""/etc/ssl\""    -g -O2 -Wall -W -Wmissing-prototypes -Wmissing-declarations -Wpointer-ari
th -Wchar-subscripts -Wformat=2 -Wbad-function-cast  -c ssl-init-openssl.c
[5-ERROR] /bin/sh ../../libtool --mode=link gcc-42  -g -O2 -Wall -W -Wmissing-prototypes -
Wmissing-declarations -Wpointer-arith -Wchar-subscripts -Wformat=2 -Wbad-function-cast   -
o dovecot  auth-process.o login-process.o mail-process.o main.o master-settings.o ssl-init
.o ssl-init-gnutls.o ssl-init-openssl.o ../lib-settings/libsettings.a 	../lib/liblib.a 
	-lgnutls -lgcrypt 
[5-ERROR] mkdir .libs
[5-ERROR] gcc-42 -g -O2 -Wall -W -Wmissing-prototypes -Wmissing-declarations -Wpointer-ari
th -Wchar-subscripts -Wformat=2 -Wbad-function-cast -o dovecot auth-process.o login-proces
s.o mail-process.o main.o master-settings.o ssl-init.o ssl-init-gnutls.o ssl-init-openssl.
o  ../lib-settings/libsettings.a ../lib/liblib.a /usr/lib/libgnutls.so -L/usr/lib /usr/lib
/libtasn1.so -lz /usr/lib/libgcrypt.so /usr/lib/libgpg-error.so -lnsl
[5-ERROR] ssl-init-gnutls.o: In function `_ssl_generate_parameters':
[5-ERROR] ssl-init-gnutls.c:(.text+0xac): undefined reference to `gnutls_dh_params_generat
e'
[5-ERROR] ssl-init-gnutls.c:(.text+0x15c): undefined reference to `gnutls_rsa_params_gener
ate'
[5-ERROR] collect2: ld returned 1 exit status
[5-ERROR] make[3]: *** [dovecot] Error 1
[5-ERROR] make[3]: Leaving directory `/ROCK/loop/src.dovecot.1181950511.5023.4161569442/do
vecot-0.99.12/src/master'
[5-ERROR] make[2]: *** [all-recursive] Error 1
[5-ERROR] make[2]: Leaving directory `/ROCK/loop/src.dovecot.1181950511.5023.4161569442/do
vecot-0.99.12/src'
[5-ERROR] make[1]: *** [all-recursive] Error 1
[5-ERROR] make[1]: Leaving directory `/ROCK/loop/src.dovecot.1181950511.5023.4161569442/do
vecot-0.99.12'
[5-ERROR] make: *** [all-recursive-am] Error 2
[5-ERROR] --- BUILD ERROR ---

[9-ERROR] gcc-42 -DHAVE_CONFIG_H -I. -I. -I../.. -I../../src/lib 	-I../../src/lib-se
ttings 	-DAUTH_MODULE_DIR=\""/usr/lib/dovecot/auth"\" 	    -g -O2 -Wall -W -Wmissing-prot
otypes -Wmissing-declarations -Wpointer-arith -Wchar-subscripts -Wformat=2 -Wbad-function-
cast  -c passdb-passwd-file.c
[9-ERROR] gcc-42 -DHAVE_CONFIG_H -I. -I. -I../.. -I../../src/lib 	-I../../src/lib-se
ttings 	-DAUTH_MODULE_DIR=\""/usr/lib/dovecot/auth"\" 	    -g -O2 -Wall -W -Wmissing-prot
otypes -Wmissing-declarations -Wpointer-arith -Wchar-subscripts -Wformat=2 -Wbad-function-
cast  -c passdb-pam.c
[9-ERROR] gcc-42 -DHAVE_CONFIG_H -I. -I. -I../.. -I../../src/lib 	-I../../src/lib-se
ttings 	-DAUTH_MODULE_DIR=\""/usr/lib/dovecot/auth"\" 	    -g -O2 -Wall -W -Wmissing-prot
otypes -Wmissing-declarations -Wpointer-arith -Wchar-subscripts -Wformat=2 -Wbad-function-
cast  -c passdb-shadow.c
[9-ERROR] gcc-42 -DHAVE_CONFIG_H -I. -I. -I../.. -I../../src/lib 	-I../../src/lib-se
ttings 	-DAUTH_MODULE_DIR=\""/usr/lib/dovecot/auth"\" 	    -g -O2 -Wall -W -Wmissing-prot
otypes -Wmissing-declarations -Wpointer-arith -Wchar-subscripts -Wformat=2 -Wbad-function-
cast  -c passdb-vpopmail.c
[9-ERROR] gcc-42 -DHAVE_CONFIG_H -I. -I. -I../.. -I../../src/lib 	-I../../src/lib-se
ttings 	-DAUTH_MODULE_DIR=\""/usr/lib/dovecot/auth"\" 	    -g -O2 -Wall -W -Wmissing-prot
otypes -Wmissing-declarations -Wpointer-arith -Wchar-subscripts -Wformat=2 -Wbad-function-
cast  -c passdb-mysql.c
[9-ERROR] gcc-42 -DHAVE_CONFIG_H -I. -I. -I../.. -I../../src/lib 	-I../../src/lib-se
ttings 	-DAUTH_MODULE_DIR=\""/usr/lib/dovecot/auth"\" 	    -g -O2 -Wall -W -Wmissing-prot
otypes -Wmissing-declarations -Wpointer-arith -Wchar-subscripts -Wformat=2 -Wbad-function-
cast  -c passdb-pgsql.c
[9-ERROR] gcc-42 -DHAVE_CONFIG_H -I. -I. -I../.. -I../../src/lib 	-I../../src/lib-se
ttings 	-DAUTH_MODULE_DIR=\""/usr/lib/dovecot/auth"\" 	    -g -O2 -Wall -W -Wmissing-prot
otypes -Wmissing-declarations -Wpointer-arith -Wchar-subscripts -Wformat=2 -Wbad-function-
cast  -c password-scheme.c
[9-ERROR] password-scheme.c: In function 'password_verify':
[9-ERROR] password-scheme.c:55: warning: pointer targets in passing argument 1 of 'SHA1' d
iffer in signedness
[9-ERROR] gcc-42 -DHAVE_CONFIG_H -I. -I. -I../.. -I../../src/lib 	-I../../src/lib-se
ttings 	-DAUTH_MODULE_DIR=\""/usr/lib/dovecot/auth"\" 	    -g -O2 -Wall -W -Wmissing-prot
otypes -Wmissing-declarations -Wpointer-arith -Wchar-subscripts -Wformat=2 -Wbad-function-
cast  -c userdb.c
[9-ERROR] gcc-42 -DHAVE_CONFIG_H -I. -I. -I../.. -I../../src/lib 	-I../../src/lib-se
ttings 	-DAUTH_MODULE_DIR=\""/usr/lib/dovecot/auth"\" 	    -g -O2 -Wall -W -Wmissing-prot
otypes -Wmissing-declarations -Wpointer-arith -Wchar-subscripts -Wformat=2 -Wbad-function-
cast  -c userdb-ldap.c
[9-ERROR] gcc-42 -DHAVE_CONFIG_H -I. -I. -I../.. -I../../src/lib 	-I../../src/lib-se
ttings 	-DAUTH_MODULE_DIR=\""/usr/lib/dovecot/auth"\" 	    -g -O2 -Wall -W -Wmissing-prot
otypes -Wmissing-declarations -Wpointer-arith -Wchar-subscripts -Wformat=2 -Wbad-function-
cast  -c userdb-passwd.c
[9-ERROR] gcc-42 -DHAVE_CONFIG_H -I. -I. -I../.. -I../../src/lib 	-I../../src/lib-se
ttings 	-DAUTH_MODULE_DIR=\""/usr/lib/dovecot/auth"\" 	    -g -O2 -Wall -W -Wmissing-prot
otypes -Wmissing-declarations -Wpointer-arith -Wchar-subscripts -Wformat=2 -Wbad-function-
cast  -c userdb-passwd-file.c
[9-ERROR] gcc-42 -DHAVE_CONFIG_H -I. -I. -I../.. -I../../src/lib 	-I../../src/lib-se
ttings 	-DAUTH_MODULE_DIR=\""/usr/lib/dovecot/auth"\" 	    -g -O2 -Wall -W -Wmissing-prot
otypes -Wmissing-declarations -Wpointer-arith -Wchar-subscripts -Wformat=2 -Wbad-function-
cast  -c userdb-static.c
[9-ERROR] gcc-42 -DHAVE_CONFIG_H -I. -I. -I../.. -I../../src/lib 	-I../../src/lib-se
ttings 	-DAUTH_MODULE_DIR=\""/usr/lib/dovecot/auth"\" 	    -g -O2 -Wall -W -Wmissing-prot
otypes -Wmissing-declarations -Wpointer-arith -Wchar-subscripts -Wformat=2 -Wbad-function-
cast  -c userdb-vpopmail.c
[9-ERROR] gcc-42 -DHAVE_CONFIG_H -I. -I. -I../.. -I../../src/lib 	-I../../src/lib-se
ttings 	-DAUTH_MODULE_DIR=\""/usr/lib/dovecot/auth"\" 	    -g -O2 -Wall -W -Wmissing-prot
otypes -Wmissing-declarations -Wpointer-arith -Wchar-subscripts -Wformat=2 -Wbad-function-
cast  -c userdb-mysql.c
[9-ERROR] gcc-42 -DHAVE_CONFIG_H -I. -I. -I../.. -I../../src/lib 	-I../../src/lib-se
ttings 	-DAUTH_MODULE_DIR=\""/usr/lib/dovecot/auth"\" 	    -g -O2 -Wall -W -Wmissing-prot
otypes -Wmissing-declarations -Wpointer-arith -Wchar-subscripts -Wformat=2 -Wbad-function-
cast  -c userdb-pgsql.c
[9-ERROR] /bin/sh ../../libtool --mode=link gcc-42  -g -O2 -Wall -W -Wmissing-prototypes -
Wmissing-declarations -Wpointer-arith -Wchar-subscripts -Wformat=2 -Wbad-function-cast   -
o dovecot-auth  auth-module.o db-ldap.o db-mysql.o db-pgsql.o db-passwd-file.o login-conne
ction.o main.o master-connection.o md5crypt.o mech.o mech-anonymous.o mech-cyrus-sasl2.o m
ech-plain.o mech-digest-md5.o mycrypt.o passdb.o passdb-ldap.o passdb-passwd.o passdb-pass
wd-file.o passdb-pam.o passdb-shadow.o passdb-vpopmail.o passdb-mysql.o passdb-pgsql.o pas
sword-scheme.o userdb.o userdb-ldap.o userdb-passwd.o userdb-passwd-file.o userdb-static.o
 userdb-vpopmail.o userdb-mysql.o userdb-pgsql.o ../lib-settings/libsettings.a 	../lib/lib
lib.a 	-lcrypt -lcrypto -lpam 	 	-export-dynamic -ldl 
[9-ERROR] mkdir .libs
[9-ERROR] gcc-42 -g -O2 -Wall -W -Wmissing-prototypes -Wmissing-declarations -Wpointer-ari
th -Wchar-subscripts -Wformat=2 -Wbad-function-cast -o dovecot-auth auth-module.o db-ldap.
o db-mysql.o db-pgsql.o db-passwd-file.o login-connection.o main.o master-connection.o md5
crypt.o mech.o mech-anonymous.o mech-cyrus-sasl2.o mech-plain.o mech-digest-md5.o mycrypt.
o passdb.o passdb-ldap.o passdb-passwd.o passdb-passwd-file.o passdb-pam.o passdb-shadow.o
 passdb-vpopmail.o passdb-mysql.o passdb-pgsql.o password-scheme.o userdb.o userdb-ldap.o 
userdb-passwd.o userdb-passwd-file.o userdb-static.o userdb-vpopmail.o userdb-mysql.o user
db-pgsql.o -Wl,--export-dynamic  ../lib-settings/libsettings.a ../lib/liblib.a -lcrypt -lc
rypto /lib/libpam.so -ldl
[9-ERROR] make[3]: Leaving directory `/ROCK/loop/src.dovecot.1181972027.8272.2938899655/do
vecot-0.99.12/src/auth'
[9-ERROR] Making all in master
[9-ERROR] make[3]: Entering directory `/ROCK/loop/src.dovecot.1181972027.8272.2938899655/d
ovecot-0.99.12/src/master'
[9-ERROR] gcc-42 -DHAVE_CONFIG_H -I. -I. -I../.. -I../../src/lib 	-I../../src/lib-se
ttings 	-DSYSCONFDIR=\""/etc"\" 	-DPKG_RUNDIR=\""/var/run/dovecot"\" 	-DPKG_LIBE
XECDIR=\""/usr/libexec/dovecot"\" 	-DMODULEDIR=\""/usr/lib/dovecot"\" 	-DSSLDIR=\
""/etc/ssl\""    -g -O2 -Wall -W -Wmissing-prototypes -Wmissing-declarations -Wpointer-ari
th -Wchar-subscripts -Wformat=2 -Wbad-function-cast  -c auth-process.c
[9-ERROR] gcc-42 -DHAVE_CONFIG_H -I. -I. -I../.. -I../../src/lib 	-I../../src/lib-se
ttings 	-DSYSCONFDIR=\""/etc"\" 	-DPKG_RUNDIR=\""/var/run/dovecot"\" 	-DPKG_LIBE
XECDIR=\""/usr/libexec/dovecot"\" 	-DMODULEDIR=\""/usr/lib/dovecot"\" 	-DSSLDIR=\
""/etc/ssl\""    -g -O2 -Wall -W -Wmissing-prototypes -Wmissing-declarations -Wpointer-ari
th -Wchar-subscripts -Wformat=2 -Wbad-function-cast  -c login-process.c
[9-ERROR] gcc-42 -DHAVE_CONFIG_H -I. -I. -I../.. -I../../src/lib 	-I../../src/lib-se
ttings 	-DSYSCONFDIR=\""/etc"\" 	-DPKG_RUNDIR=\""/var/run/dovecot"\" 	-DPKG_LIBE
XECDIR=\""/usr/libexec/dovecot"\" 	-DMODULEDIR=\""/usr/lib/dovecot"\" 	-DSSLDIR=\
""/etc/ssl\""    -g -O2 -Wall -W -Wmissing-prototypes -Wmissing-declarations -Wpointer-ari
th -Wchar-subscripts -Wformat=2 -Wbad-function-cast  -c mail-process.c
[9-ERROR] gcc-42 -DHAVE_CONFIG_H -I. -I. -I../.. -I../../src/lib 	-I../../src/lib-se
ttings 	-DSYSCONFDIR=\""/etc"\" 	-DPKG_RUNDIR=\""/var/run/dovecot"\" 	-DPKG_LIBE
XECDIR=\""/usr/libexec/dovecot"\" 	-DMODULEDIR=\""/usr/lib/dovecot"\" 	-DSSLDIR=\
""/etc/ssl\""    -g -O2 -Wall -W -Wmissing-prototypes -Wmissing-declarations -Wpointer-ari
th -Wchar-subscripts -Wformat=2 -Wbad-function-cast  -c main.c
[9-ERROR] gcc-42 -DHAVE_CONFIG_H -I. -I. -I../.. -I../../src/lib 	-I../../src/lib-se
ttings 	-DSYSCONFDIR=\""/etc"\" 	-DPKG_RUNDIR=\""/var/run/dovecot"\" 	-DPKG_LIBE
XECDIR=\""/usr/libexec/dovecot"\" 	-DMODULEDIR=\""/usr/lib/dovecot"\" 	-DSSLDIR=\
""/etc/ssl\""    -g -O2 -Wall -W -Wmissing-prototypes -Wmissing-declarations -Wpointer-ari
th -Wchar-subscripts -Wformat=2 -Wbad-function-cast  -c master-settings.c
[9-ERROR] gcc-42 -DHAVE_CONFIG_H -I. -I. -I../.. -I../../src/lib 	-I../../src/lib-se
ttings 	-DSYSCONFDIR=\""/etc"\" 	-DPKG_RUNDIR=\""/var/run/dovecot"\" 	-DPKG_LIBE
XECDIR=\""/usr/libexec/dovecot"\" 	-DMODULEDIR=\""/usr/lib/dovecot"\" 	-DSSLDIR=\
""/etc/ssl\""    -g -O2 -Wall -W -Wmissing-prototypes -Wmissing-declarations -Wpointer-ari
th -Wchar-subscripts -Wformat=2 -Wbad-function-cast  -c ssl-init.c
[9-ERROR] gcc-42 -DHAVE_CONFIG_H -I. -I. -I../.. -I../../src/lib 	-I../../src/lib-se
ttings 	-DSYSCONFDIR=\""/etc"\" 	-DPKG_RUNDIR=\""/var/run/dovecot"\" 	-DPKG_LIBE
XECDIR=\""/usr/libexec/dovecot"\" 	-DMODULEDIR=\""/usr/lib/dovecot"\" 	-DSSLDIR=\
""/etc/ssl\""    -g -O2 -Wall -W -Wmissing-prototypes -Wmissing-declarations -Wpointer-ari
th -Wchar-subscripts -Wformat=2 -Wbad-function-cast  -c ssl-init-gnutls.c
[9-ERROR] ssl-init-gnutls.c: In function 'generate_dh_parameters':
[9-ERROR] ssl-init-gnutls.c:34: warning: implicit declaration of function 'gnutls_dh_param
s_generate'
[9-ERROR] ssl-init-gnutls.c: In function 'generate_rsa_parameters':
[9-ERROR] ssl-init-gnutls.c:57: warning: implicit declaration of function 'gnutls_rsa_para
ms_generate'
[9-ERROR] gcc-42 -DHAVE_CONFIG_H -I. -I. -I../.. -I../../src/lib 	-I../../src/lib-se
ttings 	-DSYSCONFDIR=\""/etc"\" 	-DPKG_RUNDIR=\""/var/run/dovecot"\" 	-DPKG_LIBE
XECDIR=\""/usr/libexec/dovecot"\" 	-DMODULEDIR=\""/usr/lib/dovecot"\" 	-DSSLDIR=\
""/etc/ssl\""    -g -O2 -Wall -W -Wmissing-prototypes -Wmissing-declarations -Wpointer-ari
th -Wchar-subscripts -Wformat=2 -Wbad-function-cast  -c ssl-init-openssl.c
[9-ERROR] /bin/sh ../../libtool --mode=link gcc-42  -g -O2 -Wall -W -Wmissing-prototypes -
Wmissing-declarations -Wpointer-arith -Wchar-subscripts -Wformat=2 -Wbad-function-cast   -
o dovecot  auth-process.o login-process.o mail-process.o main.o master-settings.o ssl-init
.o ssl-init-gnutls.o ssl-init-openssl.o ../lib-settings/libsettings.a 	../lib/liblib.a 
	-lgnutls -lgcrypt 
[9-ERROR] mkdir .libs
[9-ERROR] gcc-42 -g -O2 -Wall -W -Wmissing-prototypes -Wmissing-declarations -Wpointer-ari
th -Wchar-subscripts -Wformat=2 -Wbad-function-cast -o dovecot auth-process.o login-proces
s.o mail-process.o main.o master-settings.o ssl-init.o ssl-init-gnutls.o ssl-init-openssl.
o  ../lib-settings/libsettings.a ../lib/liblib.a /usr/lib/libgnutls.so -L/usr/lib /usr/lib
/libtasn1.so -lz /usr/lib/libgcrypt.so /usr/lib/libgpg-error.so -lnsl
[9-ERROR] ssl-init-gnutls.o: In function `_ssl_generate_parameters':
[9-ERROR] ssl-init-gnutls.c:(.text+0xac): undefined reference to `gnutls_dh_params_generat
e'
[9-ERROR] ssl-init-gnutls.c:(.text+0x15c): undefined reference to `gnutls_rsa_params_gener
ate'
[9-ERROR] collect2: ld returned 1 exit status
[9-ERROR] make[3]: *** [dovecot] Error 1
[9-ERROR] make[3]: Leaving directory `/ROCK/loop/src.dovecot.1181972027.8272.2938899655/do
vecot-0.99.12/src/master'
[9-ERROR] make[2]: *** [all-recursive] Error 1
[9-ERROR] make[2]: Leaving directory `/ROCK/loop/src.dovecot.1181972027.8272.2938899655/do
vecot-0.99.12/src'
[9-ERROR] make[1]: *** [all-recursive] Error 1
[9-ERROR] make[1]: Leaving directory `/ROCK/loop/src.dovecot.1181972027.8272.2938899655/do
vecot-0.99.12'
[9-ERROR] make: *** [all-recursive-am] Error 2
[9-ERROR] --- BUILD ERROR ---