Package description for 'euler'

GTK+ based version of EULER for Unix / Linux systems

 EULER is a program for quickly and interactively computing with real
 and complex numbers and matrices, or with intervals, in the style of
 MatLab, Octave,... It can draw and animate your functions in two and three
 dimensions.

Various other information for package 'euler'   (Repository 'avm')

URL: http://euler.sourceforge.net/index.html

Author: Eric Boucharé <bouchare.eric@wanadoo.fr>
Maintainer: Andreas V. 'netrunner' Meier <avmeier@web.de>

License: GPL
Status: Stable
Version: 1.61.0

Download: http://dl.sourceforge.net/euler/ euler-1.61.0.tgz

Buildtime: 2553 (5) ERROR seconds (on reference hardware)
Buildtime: 2542 (9) ERROR seconds (on reference hardware)
Buildtime: 2569 (5) ERROR seconds (on reference hardware)
Buildtime: 2520 (9) ERROR seconds (on reference hardware)
Buildtime: 2507 (5) ERROR seconds (on reference hardware)
Buildtime: 2504 (9) ERROR seconds (on reference hardware)

ROCK Sources:  euler.cacheeuler.confeuler.desceuler.desktop

Error Logs

[5-ERROR] checking if libtool supports shared libraries... yes
[5-ERROR] checking whether to build shared libraries... yes
[5-ERROR] checking whether to build static libraries... yes
[5-ERROR] checking for f77 option to produce PIC... -fPIC
[5-ERROR] checking if f77 PIC flag -fPIC works... no
[5-ERROR] checking if f77 supports -c -o file.o... no
[5-ERROR] checking whether the f77 linker (ld) supports shared libraries... yes
[5-ERROR] checking dynamic linker characteristics... ./configure: line 1: f77: command not
 found
[5-ERROR] GNU/Linux ld.so
[5-ERROR] checking how to hardcode library paths into programs... immediate
[5-ERROR] checking whether stripping libraries is possible... yes
[5-ERROR] checking for pkg-config... /usr/bin/pkg-config
[5-ERROR] checking for gtk+-2.0 >= 2.6.0... yes
[5-ERROR] checking GTK_CFLAGS... -I/usr/include/freetype2 -I/usr/include/libpng12 -I/usr/X
11R7/include -I/opt/gnome2/include/gtk-2.0 -I/opt/gnome2/lib/gtk-2.0/include -I/opt/gnome2
/include/atk-1.0 -I/opt/gnome2/include/cairo -I/opt/gnome2/include/pango-1.0 -I/opt/gnome2
/include/glib-2.0 -I/opt/gnome2/lib/glib-2.0/include  
[5-ERROR] checking GTK_LIBS... -L/opt/gnome2/lib -lgtk-x11-2.0 -lgdk-x11-2.0 -latk-1.0 -lg
dk_pixbuf-2.0 -lm -lpangocairo-1.0 -lpangoft2-1.0 -lcairo -lpango-1.0 -lgobject-2.0 -lgmod
ule-2.0 -ldl -lglib-2.0  
[5-ERROR] configure: creating ./config.status
[5-ERROR] config.status: creating Makefile
[5-ERROR] config.status: creating src/Makefile
[5-ERROR] config.status: creating progs/Makefile
[5-ERROR] config.status: creating progs/user/Makefile
[5-ERROR] config.status: creating docs/Makefile
[5-ERROR] config.status: creating docs/french/Makefile
[5-ERROR] config.status: creating docs/german/Makefile
[5-ERROR] config.status: creating docs/german/images/Makefile
[5-ERROR] config.status: creating docs/images/Makefile
[5-ERROR] config.status: creating docs/reference/Makefile
[5-ERROR] config.status: creating config.h
[5-ERROR] config.status: executing depfiles commands
[5-ERROR] make  all-recursive
[5-ERROR] make[1]: Entering directory `/ROCK/loop/src.euler.1181950391.28097.4161569442/eu
ler-1.61.0'
[5-ERROR] Making all in src
[5-ERROR] make[2]: Entering directory `/ROCK/loop/src.euler.1181950391.28097.4161569442/eu
ler-1.61.0/src'
[5-ERROR] if gcc-42 -DINSTALL_DIR=\"/usr\" -DHAVE_CONFIG_H -I. -I. -I.. -I/usr/include/fre
etype2 -I/usr/include/libpng12 -I/usr/X11R7/include -I/opt/gnome2/include/gtk-2.0 -I/opt/g
nome2/lib/gtk-2.0/include -I/opt/gnome2/include/atk-1.0 -I/opt/gnome2/include/cairo -I/opt
/gnome2/include/pango-1.0 -I/opt/gnome2/include/glib-2.0 -I/opt/gnome2/lib/glib-2.0/includ
e     -Wall -O3  -MT main.o -MD -MP -MF ".deps/main.Tpo" -c -o main.o main.c; \
[5-ERROR] 	then mv -f ".deps/main.Tpo" ".deps/main.Po"; else rm -f ".deps/main.Tpo"; 
exit 1; fi
[5-ERROR] main.c: In function 'myclock':
[5-ERROR] main.c:442: error: 'CLK_TCK' undeclared (first use in this function)
[5-ERROR] main.c:442: error: (Each undeclared identifier is reported only once
[5-ERROR] main.c:442: error: for each function it appears in.)
[5-ERROR] main.c: In function 'file_select':
[5-ERROR] main.c:1152: warning: not enough variable arguments to fit a sentinel
[5-ERROR] main.c: In function 'drag_drop':
[5-ERROR] main.c:2168: warning: pointer targets in assignment differ in signedness
[5-ERROR] main.c: In function 'drag_data_received':
[5-ERROR] main.c:2224: warning: pointer targets in passing argument 1 of 'uri_list_to_gsli
st' differ in signedness
[5-ERROR] make[2]: *** [main.o] Error 1
[5-ERROR] make[2]: Leaving directory `/ROCK/loop/src.euler.1181950391.28097.4161569442/eul
er-1.61.0/src'
[5-ERROR] make[1]: *** [all-recursive] Error 1
[5-ERROR] make[1]: Leaving directory `/ROCK/loop/src.euler.1181950391.28097.4161569442/eul
er-1.61.0'
[5-ERROR] make: *** [all] Error 2
[5-ERROR] --- BUILD ERROR ---

[9-ERROR] checking if libtool supports shared libraries... yes
[9-ERROR] checking whether to build shared libraries... yes
[9-ERROR] checking whether to build static libraries... yes
[9-ERROR] checking for f77 option to produce PIC... -fPIC
[9-ERROR] checking if f77 PIC flag -fPIC works... no
[9-ERROR] checking if f77 supports -c -o file.o... no
[9-ERROR] checking whether the f77 linker (ld) supports shared libraries... yes
[9-ERROR] checking dynamic linker characteristics... ./configure: line 1: f77: command not
 found
[9-ERROR] GNU/Linux ld.so
[9-ERROR] checking how to hardcode library paths into programs... immediate
[9-ERROR] checking whether stripping libraries is possible... yes
[9-ERROR] checking for pkg-config... /usr/bin/pkg-config
[9-ERROR] checking for gtk+-2.0 >= 2.6.0... yes
[9-ERROR] checking GTK_CFLAGS... -I/usr/include/freetype2 -I/usr/include/libpng12 -I/usr/X
11R7/include -I/opt/gnome2/include/gtk-2.0 -I/opt/gnome2/lib/gtk-2.0/include -I/opt/gnome2
/include/atk-1.0 -I/opt/gnome2/include/cairo -I/opt/gnome2/include/pango-1.0 -I/opt/gnome2
/include/glib-2.0 -I/opt/gnome2/lib/glib-2.0/include  
[9-ERROR] checking GTK_LIBS... -L/opt/gnome2/lib -lgtk-x11-2.0 -lgdk-x11-2.0 -latk-1.0 -lg
dk_pixbuf-2.0 -lm -lpangocairo-1.0 -lpangoft2-1.0 -lcairo -lpango-1.0 -lgobject-2.0 -lgmod
ule-2.0 -ldl -lglib-2.0  
[9-ERROR] configure: creating ./config.status
[9-ERROR] config.status: creating Makefile
[9-ERROR] config.status: creating src/Makefile
[9-ERROR] config.status: creating progs/Makefile
[9-ERROR] config.status: creating progs/user/Makefile
[9-ERROR] config.status: creating docs/Makefile
[9-ERROR] config.status: creating docs/french/Makefile
[9-ERROR] config.status: creating docs/german/Makefile
[9-ERROR] config.status: creating docs/german/images/Makefile
[9-ERROR] config.status: creating docs/images/Makefile
[9-ERROR] config.status: creating docs/reference/Makefile
[9-ERROR] config.status: creating config.h
[9-ERROR] config.status: executing depfiles commands
[9-ERROR] make  all-recursive
[9-ERROR] make[1]: Entering directory `/ROCK/loop/src.euler.1181971908.31334.2938899655/eu
ler-1.61.0'
[9-ERROR] Making all in src
[9-ERROR] make[2]: Entering directory `/ROCK/loop/src.euler.1181971908.31334.2938899655/eu
ler-1.61.0/src'
[9-ERROR] if gcc-42 -DINSTALL_DIR=\"/usr\" -DHAVE_CONFIG_H -I. -I. -I.. -I/usr/include/fre
etype2 -I/usr/include/libpng12 -I/usr/X11R7/include -I/opt/gnome2/include/gtk-2.0 -I/opt/g
nome2/lib/gtk-2.0/include -I/opt/gnome2/include/atk-1.0 -I/opt/gnome2/include/cairo -I/opt
/gnome2/include/pango-1.0 -I/opt/gnome2/include/glib-2.0 -I/opt/gnome2/lib/glib-2.0/includ
e     -Wall -O3  -MT main.o -MD -MP -MF ".deps/main.Tpo" -c -o main.o main.c; \
[9-ERROR] 	then mv -f ".deps/main.Tpo" ".deps/main.Po"; else rm -f ".deps/main.Tpo"; 
exit 1; fi
[9-ERROR] main.c: In function 'myclock':
[9-ERROR] main.c:442: error: 'CLK_TCK' undeclared (first use in this function)
[9-ERROR] main.c:442: error: (Each undeclared identifier is reported only once
[9-ERROR] main.c:442: error: for each function it appears in.)
[9-ERROR] main.c: In function 'file_select':
[9-ERROR] main.c:1152: warning: not enough variable arguments to fit a sentinel
[9-ERROR] main.c: In function 'drag_drop':
[9-ERROR] main.c:2168: warning: pointer targets in assignment differ in signedness
[9-ERROR] main.c: In function 'drag_data_received':
[9-ERROR] main.c:2224: warning: pointer targets in passing argument 1 of 'uri_list_to_gsli
st' differ in signedness
[9-ERROR] make[2]: *** [main.o] Error 1
[9-ERROR] make[2]: Leaving directory `/ROCK/loop/src.euler.1181971908.31334.2938899655/eul
er-1.61.0/src'
[9-ERROR] make[1]: *** [all-recursive] Error 1
[9-ERROR] make[1]: Leaving directory `/ROCK/loop/src.euler.1181971908.31334.2938899655/eul
er-1.61.0'
[9-ERROR] make: *** [all] Error 2
[9-ERROR] --- BUILD ERROR ---