Package description for 'evas'

A high performance canvas library

 Evas is a hardware-accelerated canvas API for X-Windows that can draw
 anti-aliased text, smooth super and sub-sampled images, alpha-blend,
 as well as drop down to using normal X11 primitives such as pixmaps,
 lines and rectangles for speed if your CPU or graphics hardware are
 too slow.

Various other information for package 'evas'   (Repository 'e17')

URL: http://www.enlightenment.org

Author: Rasterman <raster@rasterman.com>
Maintainer: Mathieu Doidy <mdoidy@roulaize.net>

License: BSD
Status: Beta
Version: 2005-09-11

Download: cvs://pserver:anonymous@enlightenment.cvs.sourceforge.net:/cvsroot/enlightenment::e17/libs/evas/!2005-09-11/ evas-2005-09-11.tar.bz2

Buildtime: 14926 (5) ERROR seconds (on reference hardware)
Buildtime: 15226 (9) ERROR seconds (on reference hardware)
Buildtime: 15051 (5) ERROR seconds (on reference hardware)
Buildtime: 14788 (9) ERROR seconds (on reference hardware)
Buildtime: 14844 (5) ERROR seconds (on reference hardware)
Buildtime: 14503 (9) ERROR seconds (on reference hardware)

ROCK Sources:  disable-GL_NV_texture-use.patchevas.cacheevas.confevas.descgl_common-fix.patchvalgrind-fix.patch

Error Logs

[5-ERROR] gcc-42: -lz: linker input file unused because linking not done
[5-ERROR] gcc-42: -lm: linker input file unused because linking not done
[5-ERROR] if gcc-42 -DHAVE_CONFIG_H -I. -I. -I../.. -I. -I../../src/lib -I../.. -D_REENTRA
NT -I/usr/include/directfb    -I/usr/include   -g -O2 -I/usr/X11R7/include -g -O2 -MT evas
_software_x11_test-evas_software_x11_main.o -MD -MP -MF ".deps/evas_software_x11_test-evas
_software_x11_main.Tpo" -c -o evas_software_x11_test-evas_software_x11_main.o `test -f 'ev
as_software_x11_main.c' || echo './'`evas_software_x11_main.c; \
[5-ERROR] 	then mv -f ".deps/evas_software_x11_test-evas_software_x11_main.Tpo" ".dep
s/evas_software_x11_test-evas_software_x11_main.Po"; else rm -f ".deps/evas_software_x11_t
est-evas_software_x11_main.Tpo"; exit 1; fi
[5-ERROR] gcc-42: -lz: linker input file unused because linking not done
[5-ERROR] gcc-42: -lm: linker input file unused because linking not done
[5-ERROR] /bin/sh ../../libtool --tag=CC --mode=link gcc-42  -g -O2   -o evas_software_x11
_test  evas_software_x11_test-evas_test_main.o evas_software_x11_test-evas_software_x11_ma
in.o ../../src/lib/libevas.la -lm -L/usr/X11R7/lib -lX11 -lXext 
[5-ERROR] mkdir .libs
[5-ERROR] gcc-42 -g -O2 -o .libs/evas_software_x11_test evas_software_x11_test-evas_test_m
ain.o evas_software_x11_test-evas_software_x11_main.o  ../../src/lib/.libs/libevas.so /usr
/lib/libfreetype.so /usr/lib/libpng12.so -L/opt/e17/lib /opt/e17/lib/libeet.so /usr/lib/li
bjpeg.so /opt/e17/lib/libedb.so -L/usr/X11R7/lib /usr/lib/libdirectfb.so /usr/lib/libfusio
n.so /usr/lib/libdirect.so -lz -lGL -lGLU -lpthread -lm /usr/X11R7/lib/libXext.so /usr/X11
R7/lib/libX11.so /usr/lib/libxcb-xlib.so /usr/lib/libxcb.so /usr/X11R7/lib/libXdmcp.so -ld
l /usr/X11R7/lib/libXau.so -Wl,--rpath -Wl,/usr/X11R7/lib
[5-ERROR] creating evas_software_x11_test
[5-ERROR] if gcc-42 -DHAVE_CONFIG_H -I. -I. -I../.. -I. -I../../src/lib -I../.. -D_REENTRA
NT -I/usr/include/directfb    -I/usr/include   -g -O2 -I/usr/X11R7/include -g -O2 -MT evas
_software_x11_perf_test-evas_software_x11_perf_test.o -MD -MP -MF ".deps/evas_software_x11
_perf_test-evas_software_x11_perf_test.Tpo" -c -o evas_software_x11_perf_test-evas_softwar
e_x11_perf_test.o `test -f 'evas_software_x11_perf_test.c' || echo './'`evas_software_x11_
perf_test.c; \
[5-ERROR] 	then mv -f ".deps/evas_software_x11_perf_test-evas_software_x11_perf_test.
Tpo" ".deps/evas_software_x11_perf_test-evas_software_x11_perf_test.Po"; else rm -f ".deps
/evas_software_x11_perf_test-evas_software_x11_perf_test.Tpo"; exit 1; fi
[5-ERROR] gcc-42: -lz: linker input file unused because linking not done
[5-ERROR] gcc-42: -lm: linker input file unused because linking not done
[5-ERROR] /bin/sh ../../libtool --tag=CC --mode=link gcc-42  -g -O2   -o evas_software_x11
_perf_test  evas_software_x11_perf_test-evas_software_x11_perf_test.o ../../src/lib/libeva
s.la -lm -L/usr/X11R7/lib -lX11 -lXext 
[5-ERROR] gcc-42 -g -O2 -o .libs/evas_software_x11_perf_test evas_software_x11_perf_test-e
vas_software_x11_perf_test.o  ../../src/lib/.libs/libevas.so /usr/lib/libfreetype.so /usr/
lib/libpng12.so -L/opt/e17/lib /opt/e17/lib/libeet.so /usr/lib/libjpeg.so /opt/e17/lib/lib
edb.so -L/usr/X11R7/lib /usr/lib/libdirectfb.so /usr/lib/libfusion.so /usr/lib/libdirect.s
o -lz -lGL -lGLU -lpthread -lm /usr/X11R7/lib/libXext.so /usr/X11R7/lib/libX11.so /usr/lib
/libxcb-xlib.so /usr/lib/libxcb.so /usr/X11R7/lib/libXdmcp.so -ldl /usr/X11R7/lib/libXau.s
o -Wl,--rpath -Wl,/usr/X11R7/lib
[5-ERROR] creating evas_software_x11_perf_test
[5-ERROR] if gcc-42 -DHAVE_CONFIG_H -I. -I. -I../.. -I. -I../../src/lib -I../.. -D_REENTRA
NT -I/usr/include/directfb    -I/usr/include   -g -O2 -I/usr/X11R7/include -g -O2 -MT evas
_software_x11_perf_load-evas_software_x11_perf_load.o -MD -MP -MF ".deps/evas_software_x11
_perf_load-evas_software_x11_perf_load.Tpo" -c -o evas_software_x11_perf_load-evas_softwar
e_x11_perf_load.o `test -f 'evas_software_x11_perf_load.c' || echo './'`evas_software_x11_
perf_load.c; \
[5-ERROR] 	then mv -f ".deps/evas_software_x11_perf_load-evas_software_x11_perf_load.
Tpo" ".deps/evas_software_x11_perf_load-evas_software_x11_perf_load.Po"; else rm -f ".deps
/evas_software_x11_perf_load-evas_software_x11_perf_load.Tpo"; exit 1; fi
[5-ERROR] gcc-42: -lz: linker input file unused because linking not done
[5-ERROR] gcc-42: -lm: linker input file unused because linking not done
[5-ERROR] /bin/sh ../../libtool --tag=CC --mode=link gcc-42  -g -O2   -o evas_software_x11
_perf_load  evas_software_x11_perf_load-evas_software_x11_perf_load.o ../../src/lib/libeva
s.la -lm -L/usr/X11R7/lib -lX11 -lXext 
[5-ERROR] gcc-42 -g -O2 -o .libs/evas_software_x11_perf_load evas_software_x11_perf_load-e
vas_software_x11_perf_load.o  ../../src/lib/.libs/libevas.so /usr/lib/libfreetype.so /usr/
lib/libpng12.so -L/opt/e17/lib /opt/e17/lib/libeet.so /usr/lib/libjpeg.so /opt/e17/lib/lib
edb.so -L/usr/X11R7/lib /usr/lib/libdirectfb.so /usr/lib/libfusion.so /usr/lib/libdirect.s
o -lz -lGL -lGLU -lpthread -lm /usr/X11R7/lib/libXext.so /usr/X11R7/lib/libX11.so /usr/lib
/libxcb-xlib.so /usr/lib/libxcb.so /usr/X11R7/lib/libXdmcp.so -ldl /usr/X11R7/lib/libXau.s
o -Wl,--rpath -Wl,/usr/X11R7/lib
[5-ERROR] creating evas_software_x11_perf_load
[5-ERROR] if gcc-42 -DHAVE_CONFIG_H -I. -I. -I../.. -I. -I../../src/lib -I../.. -D_REENTRA
NT -I/usr/include/directfb    -I/usr/include   -g -O2 -D_REENTRANT -I/usr/include/directfb
   -g -O2 -MT evas_directfb_test-evas_test_main.o -MD -MP -MF ".deps/evas_directfb_test-ev
as_test_main.Tpo" -c -o evas_directfb_test-evas_test_main.o `test -f 'evas_test_main.c' ||
 echo './'`evas_test_main.c; \
[5-ERROR] 	then mv -f ".deps/evas_directfb_test-evas_test_main.Tpo" ".deps/evas_direc
tfb_test-evas_test_main.Po"; else rm -f ".deps/evas_directfb_test-evas_test_main.Tpo"; exi
t 1; fi
[5-ERROR] evas_test_main.c: In function 'scroll_setup':
[5-ERROR] evas_test_main.c:2021: warning: passing argument 3 of 'evas_object_event_callbac
k_add' from incompatible pointer type
[5-ERROR] evas_test_main.c: In function 'setup':
[5-ERROR] evas_test_main.c:2067: warning: passing argument 3 of 'evas_object_event_callbac
k_add' from incompatible pointer type
[5-ERROR] gcc-42: -lz: linker input file unused because linking not done
[5-ERROR] gcc-42: -lm: linker input file unused because linking not done
[5-ERROR] if gcc-42 -DHAVE_CONFIG_H -I. -I. -I../.. -I. -I../../src/lib -I../.. -D_REENTRA
NT -I/usr/include/directfb    -I/usr/include   -g -O2 -D_REENTRANT -I/usr/include/directfb
   -g -O2 -MT evas_directfb_test-evas_directfb_main.o -MD -MP -MF ".deps/evas_directfb_tes
t-evas_directfb_main.Tpo" -c -o evas_directfb_test-evas_directfb_main.o `test -f 'evas_dir
ectfb_main.c' || echo './'`evas_directfb_main.c; \
[5-ERROR] 	then mv -f ".deps/evas_directfb_test-evas_directfb_main.Tpo" ".deps/evas_d
irectfb_test-evas_directfb_main.Po"; else rm -f ".deps/evas_directfb_test-evas_directfb_ma
in.Tpo"; exit 1; fi
[5-ERROR] evas_directfb_main.c: In function 'main':
[5-ERROR] evas_directfb_main.c:29: error: 'DFBCardCapabilities' undeclared (first use in t
his function)
[5-ERROR] evas_directfb_main.c:29: error: (Each undeclared identifier is reported only onc
e
[5-ERROR] evas_directfb_main.c:29: error: for each function it appears in.)
[5-ERROR] evas_directfb_main.c:29: error: expected ';' before 'caps'
[5-ERROR] evas_directfb_main.c:48: warning: incompatible implicit declaration of built-in 
function 'memset'
[5-ERROR] make[4]: *** [evas_directfb_test-evas_directfb_main.o] Error 1
[5-ERROR] make[4]: Leaving directory `/ROCK/loop/src.evas.1181940653.9537.4079832494/evas-
2005-09-11/src/bin'
[5-ERROR] make[3]: *** [all-recursive] Error 1
[5-ERROR] make[3]: Leaving directory `/ROCK/loop/src.evas.1181940653.9537.4079832494/evas-
2005-09-11/src/bin'
[5-ERROR] make[2]: *** [all-recursive] Error 1
[5-ERROR] make[2]: Leaving directory `/ROCK/loop/src.evas.1181940653.9537.4079832494/evas-
2005-09-11/src'
[5-ERROR] make[1]: *** [all-recursive] Error 1
[5-ERROR] make[1]: Leaving directory `/ROCK/loop/src.evas.1181940653.9537.4079832494/evas-
2005-09-11'
[5-ERROR] make: *** [all] Error 2
[5-ERROR] --- BUILD ERROR ---

[9-ERROR] gcc-42: -lz: linker input file unused because linking not done
[9-ERROR] gcc-42: -lm: linker input file unused because linking not done
[9-ERROR] if gcc-42 -DHAVE_CONFIG_H -I. -I. -I../.. -I. -I../../src/lib -I../.. -D_REENTRA
NT -I/usr/include/directfb    -I/usr/include   -g -O2 -I/usr/X11R7/include -g -O2 -MT evas
_software_x11_test-evas_software_x11_main.o -MD -MP -MF ".deps/evas_software_x11_test-evas
_software_x11_main.Tpo" -c -o evas_software_x11_test-evas_software_x11_main.o `test -f 'ev
as_software_x11_main.c' || echo './'`evas_software_x11_main.c; \
[9-ERROR] 	then mv -f ".deps/evas_software_x11_test-evas_software_x11_main.Tpo" ".dep
s/evas_software_x11_test-evas_software_x11_main.Po"; else rm -f ".deps/evas_software_x11_t
est-evas_software_x11_main.Tpo"; exit 1; fi
[9-ERROR] gcc-42: -lz: linker input file unused because linking not done
[9-ERROR] gcc-42: -lm: linker input file unused because linking not done
[9-ERROR] /bin/sh ../../libtool --tag=CC --mode=link gcc-42  -g -O2   -o evas_software_x11
_test  evas_software_x11_test-evas_test_main.o evas_software_x11_test-evas_software_x11_ma
in.o ../../src/lib/libevas.la -lm -L/usr/X11R7/lib -lX11 -lXext 
[9-ERROR] mkdir .libs
[9-ERROR] gcc-42 -g -O2 -o .libs/evas_software_x11_test evas_software_x11_test-evas_test_m
ain.o evas_software_x11_test-evas_software_x11_main.o  ../../src/lib/.libs/libevas.so /usr
/lib/libfreetype.so /usr/lib/libpng12.so -L/opt/e17/lib /opt/e17/lib/libeet.so /usr/lib/li
bjpeg.so /opt/e17/lib/libedb.so -L/usr/X11R7/lib /usr/lib/libdirectfb.so /usr/lib/libfusio
n.so /usr/lib/libdirect.so -lz -lGL -lGLU -lpthread -lm /usr/X11R7/lib/libXext.so /usr/X11
R7/lib/libX11.so /usr/lib/libxcb-xlib.so /usr/lib/libxcb.so /usr/X11R7/lib/libXdmcp.so -ld
l /usr/X11R7/lib/libXau.so -Wl,--rpath -Wl,/usr/X11R7/lib
[9-ERROR] creating evas_software_x11_test
[9-ERROR] if gcc-42 -DHAVE_CONFIG_H -I. -I. -I../.. -I. -I../../src/lib -I../.. -D_REENTRA
NT -I/usr/include/directfb    -I/usr/include   -g -O2 -I/usr/X11R7/include -g -O2 -MT evas
_software_x11_perf_test-evas_software_x11_perf_test.o -MD -MP -MF ".deps/evas_software_x11
_perf_test-evas_software_x11_perf_test.Tpo" -c -o evas_software_x11_perf_test-evas_softwar
e_x11_perf_test.o `test -f 'evas_software_x11_perf_test.c' || echo './'`evas_software_x11_
perf_test.c; \
[9-ERROR] 	then mv -f ".deps/evas_software_x11_perf_test-evas_software_x11_perf_test.
Tpo" ".deps/evas_software_x11_perf_test-evas_software_x11_perf_test.Po"; else rm -f ".deps
/evas_software_x11_perf_test-evas_software_x11_perf_test.Tpo"; exit 1; fi
[9-ERROR] gcc-42: -lz: linker input file unused because linking not done
[9-ERROR] gcc-42: -lm: linker input file unused because linking not done
[9-ERROR] /bin/sh ../../libtool --tag=CC --mode=link gcc-42  -g -O2   -o evas_software_x11
_perf_test  evas_software_x11_perf_test-evas_software_x11_perf_test.o ../../src/lib/libeva
s.la -lm -L/usr/X11R7/lib -lX11 -lXext 
[9-ERROR] gcc-42 -g -O2 -o .libs/evas_software_x11_perf_test evas_software_x11_perf_test-e
vas_software_x11_perf_test.o  ../../src/lib/.libs/libevas.so /usr/lib/libfreetype.so /usr/
lib/libpng12.so -L/opt/e17/lib /opt/e17/lib/libeet.so /usr/lib/libjpeg.so /opt/e17/lib/lib
edb.so -L/usr/X11R7/lib /usr/lib/libdirectfb.so /usr/lib/libfusion.so /usr/lib/libdirect.s
o -lz -lGL -lGLU -lpthread -lm /usr/X11R7/lib/libXext.so /usr/X11R7/lib/libX11.so /usr/lib
/libxcb-xlib.so /usr/lib/libxcb.so /usr/X11R7/lib/libXdmcp.so -ldl /usr/X11R7/lib/libXau.s
o -Wl,--rpath -Wl,/usr/X11R7/lib
[9-ERROR] creating evas_software_x11_perf_test
[9-ERROR] if gcc-42 -DHAVE_CONFIG_H -I. -I. -I../.. -I. -I../../src/lib -I../.. -D_REENTRA
NT -I/usr/include/directfb    -I/usr/include   -g -O2 -I/usr/X11R7/include -g -O2 -MT evas
_software_x11_perf_load-evas_software_x11_perf_load.o -MD -MP -MF ".deps/evas_software_x11
_perf_load-evas_software_x11_perf_load.Tpo" -c -o evas_software_x11_perf_load-evas_softwar
e_x11_perf_load.o `test -f 'evas_software_x11_perf_load.c' || echo './'`evas_software_x11_
perf_load.c; \
[9-ERROR] 	then mv -f ".deps/evas_software_x11_perf_load-evas_software_x11_perf_load.
Tpo" ".deps/evas_software_x11_perf_load-evas_software_x11_perf_load.Po"; else rm -f ".deps
/evas_software_x11_perf_load-evas_software_x11_perf_load.Tpo"; exit 1; fi
[9-ERROR] gcc-42: -lz: linker input file unused because linking not done
[9-ERROR] gcc-42: -lm: linker input file unused because linking not done
[9-ERROR] /bin/sh ../../libtool --tag=CC --mode=link gcc-42  -g -O2   -o evas_software_x11
_perf_load  evas_software_x11_perf_load-evas_software_x11_perf_load.o ../../src/lib/libeva
s.la -lm -L/usr/X11R7/lib -lX11 -lXext 
[9-ERROR] gcc-42 -g -O2 -o .libs/evas_software_x11_perf_load evas_software_x11_perf_load-e
vas_software_x11_perf_load.o  ../../src/lib/.libs/libevas.so /usr/lib/libfreetype.so /usr/
lib/libpng12.so -L/opt/e17/lib /opt/e17/lib/libeet.so /usr/lib/libjpeg.so /opt/e17/lib/lib
edb.so -L/usr/X11R7/lib /usr/lib/libdirectfb.so /usr/lib/libfusion.so /usr/lib/libdirect.s
o -lz -lGL -lGLU -lpthread -lm /usr/X11R7/lib/libXext.so /usr/X11R7/lib/libX11.so /usr/lib
/libxcb-xlib.so /usr/lib/libxcb.so /usr/X11R7/lib/libXdmcp.so -ldl /usr/X11R7/lib/libXau.s
o -Wl,--rpath -Wl,/usr/X11R7/lib
[9-ERROR] creating evas_software_x11_perf_load
[9-ERROR] if gcc-42 -DHAVE_CONFIG_H -I. -I. -I../.. -I. -I../../src/lib -I../.. -D_REENTRA
NT -I/usr/include/directfb    -I/usr/include   -g -O2 -D_REENTRANT -I/usr/include/directfb
   -g -O2 -MT evas_directfb_test-evas_test_main.o -MD -MP -MF ".deps/evas_directfb_test-ev
as_test_main.Tpo" -c -o evas_directfb_test-evas_test_main.o `test -f 'evas_test_main.c' ||
 echo './'`evas_test_main.c; \
[9-ERROR] 	then mv -f ".deps/evas_directfb_test-evas_test_main.Tpo" ".deps/evas_direc
tfb_test-evas_test_main.Po"; else rm -f ".deps/evas_directfb_test-evas_test_main.Tpo"; exi
t 1; fi
[9-ERROR] evas_test_main.c: In function 'scroll_setup':
[9-ERROR] evas_test_main.c:2021: warning: passing argument 3 of 'evas_object_event_callbac
k_add' from incompatible pointer type
[9-ERROR] evas_test_main.c: In function 'setup':
[9-ERROR] evas_test_main.c:2067: warning: passing argument 3 of 'evas_object_event_callbac
k_add' from incompatible pointer type
[9-ERROR] gcc-42: -lz: linker input file unused because linking not done
[9-ERROR] gcc-42: -lm: linker input file unused because linking not done
[9-ERROR] if gcc-42 -DHAVE_CONFIG_H -I. -I. -I../.. -I. -I../../src/lib -I../.. -D_REENTRA
NT -I/usr/include/directfb    -I/usr/include   -g -O2 -D_REENTRANT -I/usr/include/directfb
   -g -O2 -MT evas_directfb_test-evas_directfb_main.o -MD -MP -MF ".deps/evas_directfb_tes
t-evas_directfb_main.Tpo" -c -o evas_directfb_test-evas_directfb_main.o `test -f 'evas_dir
ectfb_main.c' || echo './'`evas_directfb_main.c; \
[9-ERROR] 	then mv -f ".deps/evas_directfb_test-evas_directfb_main.Tpo" ".deps/evas_d
irectfb_test-evas_directfb_main.Po"; else rm -f ".deps/evas_directfb_test-evas_directfb_ma
in.Tpo"; exit 1; fi
[9-ERROR] evas_directfb_main.c: In function 'main':
[9-ERROR] evas_directfb_main.c:29: error: 'DFBCardCapabilities' undeclared (first use in t
his function)
[9-ERROR] evas_directfb_main.c:29: error: (Each undeclared identifier is reported only onc
e
[9-ERROR] evas_directfb_main.c:29: error: for each function it appears in.)
[9-ERROR] evas_directfb_main.c:29: error: expected ';' before 'caps'
[9-ERROR] evas_directfb_main.c:48: warning: incompatible implicit declaration of built-in 
function 'memset'
[9-ERROR] make[4]: *** [evas_directfb_test-evas_directfb_main.o] Error 1
[9-ERROR] make[4]: Leaving directory `/ROCK/loop/src.evas.1181961209.32415.1874910178/evas
-2005-09-11/src/bin'
[9-ERROR] make[3]: *** [all-recursive] Error 1
[9-ERROR] make[3]: Leaving directory `/ROCK/loop/src.evas.1181961209.32415.1874910178/evas
-2005-09-11/src/bin'
[9-ERROR] make[2]: *** [all-recursive] Error 1
[9-ERROR] make[2]: Leaving directory `/ROCK/loop/src.evas.1181961209.32415.1874910178/evas
-2005-09-11/src'
[9-ERROR] make[1]: *** [all-recursive] Error 1
[9-ERROR] make[1]: Leaving directory `/ROCK/loop/src.evas.1181961209.32415.1874910178/evas
-2005-09-11'
[9-ERROR] make: *** [all] Error 2
[9-ERROR] --- BUILD ERROR ---