Package description for 'gpart'

partition table recovery tool

 A tool which tries to guess the primary partition table of a PC-type hard 
 disk in case the primary partition table in sector 0 is damaged, incorrect
 or deleted. The guessed table can be written to a file or device. 
 Supported (guessable) filesystem or partition types: DOS/Windows FAT, Linux 
 ext2 and swap, OS/2 HPFS, Windows NTFS, FreeBSD and Solaris/x86 disklabels, 
 Minix FS, QNX 4 FS, Reiser FS, LVM physical volumes, BeOS FS, SGI XFS.

Various other information for package 'gpart'   (Repository 'nikolaus')

URL: http://www.stud.uni-hannover.de/user/76201/gpart/

Author: Michail Brzitwa <michail@brzitwa.de>
Maintainer: Nikolaus Filus <NFilus@gmx.net>

License: GPL
Status: Gamma
Version: 0.1h

Download: http://www.stud.uni-hannover.de/user/76201/gpart/ gpart-0.1h.tar.gz

Buildtime: 1180 (5) ERROR seconds (on reference hardware)
Buildtime: 1327 (9) ERROR seconds (on reference hardware)
Buildtime: 1350 (5) ERROR seconds (on reference hardware)
Buildtime: 1325 (9) ERROR seconds (on reference hardware)
Buildtime: 1295 (5) ERROR seconds (on reference hardware)
Buildtime: 1291 (9) ERROR seconds (on reference hardware)

ROCK Sources:  errno.patchgpart.cachegpart.descinstpath.patch

Error Logs

[5-ERROR] This is free software; see the source for copying conditions.  There is NO
[5-ERROR] warranty; not even for MERCHANTABILITY or FITNESS FOR A PARTICULAR PURPOSE.
[5-ERROR] 
[5-ERROR] [ writing debug log to /ROCK/src.gpart.1181954905.6029.1627887995/cmd_wrapper.lo
g ]
[5-ERROR] Running main build function 'build_this_package' ...
[5-ERROR] Extracting gpart-0.1h.tar.bz2 (tar -v --use-compress-program=bzip2 -xf) ... 
[5-ERROR] Fixing ownership and permissions ...
[5-ERROR] Removing CVS and .svn directories ...
[5-ERROR] Changeing into /ROCK/src.gpart.1181954905.6029.1627887995/gpart-0.1h ...
[5-ERROR] Apply patch /ROCK/package/nikolaus/gpart/errno.patch ...
[5-ERROR] patching file src/disku.c
[5-ERROR] patching file src/l64seek.c
[5-ERROR] Apply patch /ROCK/package/nikolaus/gpart/instpath.patch ...
[5-ERROR] patching file inst.defs
[5-ERROR] Creating /usr/<..> if required ...
[5-ERROR] make -C src
[5-ERROR] make[1]: Entering directory `/ROCK/loop/src.gpart.1181954905.6029.1627887995/gpa
rt-0.1h/src'
[5-ERROR] make[1]: Leaving directory `/ROCK/loop/src.gpart.1181954905.6029.1627887995/gpar
t-0.1h/src'
[5-ERROR] make[1]: Entering directory `/ROCK/loop/src.gpart.1181954905.6029.1627887995/gpa
rt-0.1h/src'
[5-ERROR] gcc-42 -Wall -O2 -pedantic -DVERSION=\"0.1h\"   -c -o gpart.o gpart.c
[5-ERROR] gpart.c:72: warning: built-in function 'log' declared as non-function
[5-ERROR] gcc-42 -Wall -O2 -pedantic -DVERSION=\"0.1h\"   -c -o gmodules.o gmodules.c
[5-ERROR] gmodules.c: In function 'g_mod_addexternal':
[5-ERROR] gmodules.c:193: warning: ISO C forbids conversion of object pointer to function 
pointer type
[5-ERROR] gmodules.c:195: warning: ISO C forbids conversion of object pointer to function 
pointer type
[5-ERROR] gmodules.c:197: warning: ISO C forbids conversion of object pointer to function 
pointer type
[5-ERROR] gcc-42 -Wall -O2 -pedantic -DVERSION=\"0.1h\"   -c -o disku.o disku.c
[5-ERROR] gcc-42 -Wall -O2 -pedantic -DVERSION=\"0.1h\"   -c -o l64seek.o l64seek.c
[5-ERROR] l64seek.c:30: error: expected declaration specifiers or '...' before '_llseek'
[5-ERROR] l64seek.c:30: error: expected declaration specifiers or '...' before 'fd'
[5-ERROR] l64seek.c:30: error: expected declaration specifiers or '...' before 'hi'
[5-ERROR] l64seek.c:30: error: expected declaration specifiers or '...' before 'lo'
[5-ERROR] l64seek.c:30: error: expected declaration specifiers or '...' before 'res'
[5-ERROR] l64seek.c:30: error: expected declaration specifiers or '...' before 'wh'
[5-ERROR] l64seek.c:35: warning: return type defaults to 'int'
[5-ERROR] l64seek.c: In function '_syscall5':
[5-ERROR] l64seek.c:36: error: expected '=', ',', ';', 'asm' or '__attribute__' before '{'
 token
[5-ERROR] l64seek.c:60: error: expected '=', ',', ';', 'asm' or '__attribute__' before '{'
 token
[5-ERROR] l64seek.c:77: error: expected '=', ',', ';', 'asm' or '__attribute__' before '{'
 token
[5-ERROR] l64seek.c:30: error: parameter name omitted
[5-ERROR] l64seek.c:30: error: parameter name omitted
[5-ERROR] l64seek.c:30: error: parameter name omitted
[5-ERROR] l64seek.c:30: error: parameter name omitted
[5-ERROR] l64seek.c:30: error: parameter name omitted
[5-ERROR] l64seek.c:30: error: parameter name omitted
[5-ERROR] l64seek.c:81: error: expected '{' at end of input
[5-ERROR] make[1]: *** [l64seek.o] Error 1
[5-ERROR] make[1]: Leaving directory `/ROCK/loop/src.gpart.1181954905.6029.1627887995/gpar
t-0.1h/src'
[5-ERROR] make: *** [gpart] Error 2
[5-ERROR] --- BUILD ERROR ---

[9-ERROR] This is free software; see the source for copying conditions.  There is NO
[9-ERROR] warranty; not even for MERCHANTABILITY or FITNESS FOR A PARTICULAR PURPOSE.
[9-ERROR] 
[9-ERROR] [ writing debug log to /ROCK/src.gpart.1181976767.13149.3474453109/cmd_wrapper.l
og ]
[9-ERROR] Running main build function 'build_this_package' ...
[9-ERROR] Extracting gpart-0.1h.tar.bz2 (tar -v --use-compress-program=bzip2 -xf) ... 
[9-ERROR] Fixing ownership and permissions ...
[9-ERROR] Removing CVS and .svn directories ...
[9-ERROR] Changeing into /ROCK/src.gpart.1181976767.13149.3474453109/gpart-0.1h ...
[9-ERROR] Apply patch /ROCK/package/nikolaus/gpart/errno.patch ...
[9-ERROR] patching file src/disku.c
[9-ERROR] patching file src/l64seek.c
[9-ERROR] Apply patch /ROCK/package/nikolaus/gpart/instpath.patch ...
[9-ERROR] patching file inst.defs
[9-ERROR] Creating /usr/<..> if required ...
[9-ERROR] make -C src
[9-ERROR] make[1]: Entering directory `/ROCK/loop/src.gpart.1181976767.13149.3474453109/gp
art-0.1h/src'
[9-ERROR] make[1]: Leaving directory `/ROCK/loop/src.gpart.1181976767.13149.3474453109/gpa
rt-0.1h/src'
[9-ERROR] make[1]: Entering directory `/ROCK/loop/src.gpart.1181976767.13149.3474453109/gp
art-0.1h/src'
[9-ERROR] gcc-42 -Wall -O2 -pedantic -DVERSION=\"0.1h\"   -c -o gpart.o gpart.c
[9-ERROR] gpart.c:72: warning: built-in function 'log' declared as non-function
[9-ERROR] gcc-42 -Wall -O2 -pedantic -DVERSION=\"0.1h\"   -c -o gmodules.o gmodules.c
[9-ERROR] gmodules.c: In function 'g_mod_addexternal':
[9-ERROR] gmodules.c:193: warning: ISO C forbids conversion of object pointer to function 
pointer type
[9-ERROR] gmodules.c:195: warning: ISO C forbids conversion of object pointer to function 
pointer type
[9-ERROR] gmodules.c:197: warning: ISO C forbids conversion of object pointer to function 
pointer type
[9-ERROR] gcc-42 -Wall -O2 -pedantic -DVERSION=\"0.1h\"   -c -o disku.o disku.c
[9-ERROR] gcc-42 -Wall -O2 -pedantic -DVERSION=\"0.1h\"   -c -o l64seek.o l64seek.c
[9-ERROR] l64seek.c:30: error: expected declaration specifiers or '...' before '_llseek'
[9-ERROR] l64seek.c:30: error: expected declaration specifiers or '...' before 'fd'
[9-ERROR] l64seek.c:30: error: expected declaration specifiers or '...' before 'hi'
[9-ERROR] l64seek.c:30: error: expected declaration specifiers or '...' before 'lo'
[9-ERROR] l64seek.c:30: error: expected declaration specifiers or '...' before 'res'
[9-ERROR] l64seek.c:30: error: expected declaration specifiers or '...' before 'wh'
[9-ERROR] l64seek.c:35: warning: return type defaults to 'int'
[9-ERROR] l64seek.c: In function '_syscall5':
[9-ERROR] l64seek.c:36: error: expected '=', ',', ';', 'asm' or '__attribute__' before '{'
 token
[9-ERROR] l64seek.c:60: error: expected '=', ',', ';', 'asm' or '__attribute__' before '{'
 token
[9-ERROR] l64seek.c:77: error: expected '=', ',', ';', 'asm' or '__attribute__' before '{'
 token
[9-ERROR] l64seek.c:30: error: parameter name omitted
[9-ERROR] l64seek.c:30: error: parameter name omitted
[9-ERROR] l64seek.c:30: error: parameter name omitted
[9-ERROR] l64seek.c:30: error: parameter name omitted
[9-ERROR] l64seek.c:30: error: parameter name omitted
[9-ERROR] l64seek.c:30: error: parameter name omitted
[9-ERROR] l64seek.c:81: error: expected '{' at end of input
[9-ERROR] make[1]: *** [l64seek.o] Error 1
[9-ERROR] make[1]: Leaving directory `/ROCK/loop/src.gpart.1181976767.13149.3474453109/gpa
rt-0.1h/src'
[9-ERROR] make: *** [gpart] Error 2
[9-ERROR] --- BUILD ERROR ---