Package description for 'ladspa-vcf'

LADSPA Plugin

 LADSPA  plugins for audio EQ biquad.

Various other information for package 'ladspa-vcf'   (Repository 'sirkull')

URL: http://www.suse.de/~mana/ladspa.html

Author: Matthias Nagorni
Maintainer: Chris Efant <rock@sirkull.org>

License: GPL
Status: Beta
Version: 0.0.5

Download: http://www.suse.de/~mana/ vcf-0.0.5.tar.bz2

Buildtime: 1178 (5) ERROR seconds (on reference hardware)
Buildtime: 1202 (9) ERROR seconds (on reference hardware)
Buildtime: 1190 (5) ERROR seconds (on reference hardware)
Buildtime: 1170 (9) ERROR seconds (on reference hardware)
Buildtime: 1164 (5) ERROR seconds (on reference hardware)
Buildtime: 1145 (9) ERROR seconds (on reference hardware)

ROCK Sources:  ladspa-vcf.cacheladspa-vcf.confladspa-vcf.desc

Error Logs

[5-ERROR] vcf.so.c:2312: error: expected expression before ')' token
[5-ERROR] vcf.so.c:2313: error: expected ')' before 'LADSPA_PortDescriptor'
[5-ERROR] vcf.so.c:2314: error: expected expression before ')' token
[5-ERROR] vcf.so.c:2315: error: expected ')' before 'LADSPA_PortRangeHint'
[5-ERROR] vcf.so.c:2381: error: 'instantiate_vcf_lshelf' undeclared (first use in this fun
ction)
[5-ERROR] vcf.so.c:2382: error: 'activate_vcf_lshelf' undeclared (first use in this functi
on)
[5-ERROR] vcf.so.c:2383: error: 'connect_port_vcf_lshelf' undeclared (first use in this fu
nction)
[5-ERROR] vcf.so.c:2384: error: 'run_vcf_lshelf' undeclared (first use in this function)
[5-ERROR] vcf.so.c:2385: error: 'cleanup_vcf_lshelf' undeclared (first use in this functio
n)
[5-ERROR] vcf.so.c:2397: error: expected expression before ')' token
[5-ERROR] vcf.so.c:2398: error: expected ')' before 'LADSPA_PortDescriptor'
[5-ERROR] vcf.so.c:2399: error: expected expression before ')' token
[5-ERROR] vcf.so.c:2400: error: expected ')' before 'LADSPA_PortRangeHint'
[5-ERROR] vcf.so.c:2466: error: 'instantiate_vcf_hshelf' undeclared (first use in this fun
ction)
[5-ERROR] vcf.so.c:2467: error: 'activate_vcf_hshelf' undeclared (first use in this functi
on)
[5-ERROR] vcf.so.c:2468: error: 'connect_port_vcf_hshelf' undeclared (first use in this fu
nction)
[5-ERROR] vcf.so.c:2469: error: 'run_vcf_hshelf' undeclared (first use in this function)
[5-ERROR] vcf.so.c:2470: error: 'cleanup_vcf_hshelf' undeclared (first use in this functio
n)
[5-ERROR] vcf.so.c: In function 'fini':
[5-ERROR] vcf.so.c:2480: error: 'vcf_reslp_Descriptor' undeclared (first use in this funct
ion)
[5-ERROR] vcf.so.c:2484: error: 'LADSPA_PortDescriptor' undeclared (first use in this func
tion)
[5-ERROR] vcf.so.c:2484: error: expected expression before ')' token
[5-ERROR] vcf.so.c:2489: error: 'LADSPA_PortRangeHint' undeclared (first use in this funct
ion)
[5-ERROR] vcf.so.c:2489: error: expected expression before ')' token
[5-ERROR] vcf.so.c:2492: error: 'vcf_lp_Descriptor' undeclared (first use in this function
)
[5-ERROR] vcf.so.c:2496: error: expected expression before ')' token
[5-ERROR] vcf.so.c:2501: error: expected expression before ')' token
[5-ERROR] vcf.so.c:2504: error: 'vcf_hp_Descriptor' undeclared (first use in this function
)
[5-ERROR] vcf.so.c:2508: error: expected expression before ')' token
[5-ERROR] vcf.so.c:2513: error: expected expression before ')' token
[5-ERROR] vcf.so.c:2516: error: 'vcf_bp1_Descriptor' undeclared (first use in this functio
n)
[5-ERROR] vcf.so.c:2520: error: expected expression before ')' token
[5-ERROR] vcf.so.c:2525: error: expected expression before ')' token
[5-ERROR] vcf.so.c:2528: error: 'vcf_bp2_Descriptor' undeclared (first use in this functio
n)
[5-ERROR] vcf.so.c:2532: error: expected expression before ')' token
[5-ERROR] vcf.so.c:2537: error: expected expression before ')' token
[5-ERROR] vcf.so.c:2540: error: 'vcf_notch_Descriptor' undeclared (first use in this funct
ion)
[5-ERROR] vcf.so.c:2544: error: expected expression before ')' token
[5-ERROR] vcf.so.c:2549: error: expected expression before ')' token
[5-ERROR] vcf.so.c:2552: error: 'vcf_peakeq_Descriptor' undeclared (first use in this func
tion)
[5-ERROR] vcf.so.c:2556: error: expected expression before ')' token
[5-ERROR] vcf.so.c:2561: error: expected expression before ')' token
[5-ERROR] vcf.so.c:2564: error: 'vcf_lshelf_Descriptor' undeclared (first use in this func
tion)
[5-ERROR] vcf.so.c:2568: error: expected expression before ')' token
[5-ERROR] vcf.so.c:2573: error: expected expression before ')' token
[5-ERROR] vcf.so.c:2576: error: 'vcf_hshelf_Descriptor' undeclared (first use in this func
tion)
[5-ERROR] vcf.so.c:2580: error: expected expression before ')' token
[5-ERROR] vcf.so.c:2585: error: expected expression before ')' token
[5-ERROR] make: *** [vcf_cv_in.o] Error 1
[5-ERROR] --- BUILD ERROR ---

[9-ERROR] vcf.so.c:2312: error: expected expression before ')' token
[9-ERROR] vcf.so.c:2313: error: expected ')' before 'LADSPA_PortDescriptor'
[9-ERROR] vcf.so.c:2314: error: expected expression before ')' token
[9-ERROR] vcf.so.c:2315: error: expected ')' before 'LADSPA_PortRangeHint'
[9-ERROR] vcf.so.c:2381: error: 'instantiate_vcf_lshelf' undeclared (first use in this fun
ction)
[9-ERROR] vcf.so.c:2382: error: 'activate_vcf_lshelf' undeclared (first use in this functi
on)
[9-ERROR] vcf.so.c:2383: error: 'connect_port_vcf_lshelf' undeclared (first use in this fu
nction)
[9-ERROR] vcf.so.c:2384: error: 'run_vcf_lshelf' undeclared (first use in this function)
[9-ERROR] vcf.so.c:2385: error: 'cleanup_vcf_lshelf' undeclared (first use in this functio
n)
[9-ERROR] vcf.so.c:2397: error: expected expression before ')' token
[9-ERROR] vcf.so.c:2398: error: expected ')' before 'LADSPA_PortDescriptor'
[9-ERROR] vcf.so.c:2399: error: expected expression before ')' token
[9-ERROR] vcf.so.c:2400: error: expected ')' before 'LADSPA_PortRangeHint'
[9-ERROR] vcf.so.c:2466: error: 'instantiate_vcf_hshelf' undeclared (first use in this fun
ction)
[9-ERROR] vcf.so.c:2467: error: 'activate_vcf_hshelf' undeclared (first use in this functi
on)
[9-ERROR] vcf.so.c:2468: error: 'connect_port_vcf_hshelf' undeclared (first use in this fu
nction)
[9-ERROR] vcf.so.c:2469: error: 'run_vcf_hshelf' undeclared (first use in this function)
[9-ERROR] vcf.so.c:2470: error: 'cleanup_vcf_hshelf' undeclared (first use in this functio
n)
[9-ERROR] vcf.so.c: In function 'fini':
[9-ERROR] vcf.so.c:2480: error: 'vcf_reslp_Descriptor' undeclared (first use in this funct
ion)
[9-ERROR] vcf.so.c:2484: error: 'LADSPA_PortDescriptor' undeclared (first use in this func
tion)
[9-ERROR] vcf.so.c:2484: error: expected expression before ')' token
[9-ERROR] vcf.so.c:2489: error: 'LADSPA_PortRangeHint' undeclared (first use in this funct
ion)
[9-ERROR] vcf.so.c:2489: error: expected expression before ')' token
[9-ERROR] vcf.so.c:2492: error: 'vcf_lp_Descriptor' undeclared (first use in this function
)
[9-ERROR] vcf.so.c:2496: error: expected expression before ')' token
[9-ERROR] vcf.so.c:2501: error: expected expression before ')' token
[9-ERROR] vcf.so.c:2504: error: 'vcf_hp_Descriptor' undeclared (first use in this function
)
[9-ERROR] vcf.so.c:2508: error: expected expression before ')' token
[9-ERROR] vcf.so.c:2513: error: expected expression before ')' token
[9-ERROR] vcf.so.c:2516: error: 'vcf_bp1_Descriptor' undeclared (first use in this functio
n)
[9-ERROR] vcf.so.c:2520: error: expected expression before ')' token
[9-ERROR] vcf.so.c:2525: error: expected expression before ')' token
[9-ERROR] vcf.so.c:2528: error: 'vcf_bp2_Descriptor' undeclared (first use in this functio
n)
[9-ERROR] vcf.so.c:2532: error: expected expression before ')' token
[9-ERROR] vcf.so.c:2537: error: expected expression before ')' token
[9-ERROR] vcf.so.c:2540: error: 'vcf_notch_Descriptor' undeclared (first use in this funct
ion)
[9-ERROR] vcf.so.c:2544: error: expected expression before ')' token
[9-ERROR] vcf.so.c:2549: error: expected expression before ')' token
[9-ERROR] vcf.so.c:2552: error: 'vcf_peakeq_Descriptor' undeclared (first use in this func
tion)
[9-ERROR] vcf.so.c:2556: error: expected expression before ')' token
[9-ERROR] vcf.so.c:2561: error: expected expression before ')' token
[9-ERROR] vcf.so.c:2564: error: 'vcf_lshelf_Descriptor' undeclared (first use in this func
tion)
[9-ERROR] vcf.so.c:2568: error: expected expression before ')' token
[9-ERROR] vcf.so.c:2573: error: expected expression before ')' token
[9-ERROR] vcf.so.c:2576: error: 'vcf_hshelf_Descriptor' undeclared (first use in this func
tion)
[9-ERROR] vcf.so.c:2580: error: expected expression before ')' token
[9-ERROR] vcf.so.c:2585: error: expected expression before ')' token
[9-ERROR] make: *** [vcf_cv_in.o] Error 1
[9-ERROR] --- BUILD ERROR ---