Package description for 'ladspa-vocoder'

LADSPA Vocoder Plugin

 A vocoder is a sound effect that can make a human voice sound synthetic. 
 It is often used to speak like a robot, with a metallic and monotonous 
 voice.

Various other information for package 'ladspa-vocoder'   (Repository 'sirkull')

URL: http://www.sirlab.de/linux/descr_vocoder.html

Author: Achim Settelmeier's <settel-linux@sirlab.de>
Maintainer: Chris Efant <rock@sirkull.org>

License: GPL
Status: Beta
Version: 0.3

Download: http://www.sirlab.de/linux/download/ vocoder-ladspa-0.3.tgz

Buildtime: 1223 (5) ERROR seconds (on reference hardware)
Buildtime: 1186 (9) ERROR seconds (on reference hardware)
Buildtime: 1179 (5) ERROR seconds (on reference hardware)
Buildtime: 1172 (9) ERROR seconds (on reference hardware)
Buildtime: 1161 (5) ERROR seconds (on reference hardware)
Buildtime: 1153 (9) ERROR seconds (on reference hardware)

ROCK Sources:  ladspa-vocoder.cacheladspa-vocoder.confladspa-vocoder.desc

Error Logs

[5-ERROR] vocoder.c:176: error: 'struct bandpass' has no member named 'mid2'
[5-ERROR] vocoder.c:176: error: 'struct bandpass' has no member named 'high2'
[5-ERROR] vocoder.c:176: error: 'struct bandpass' has no member named 'c'
[5-ERROR] vocoder.c:177: error: 'struct bandpass' has no member named 'low2'
[5-ERROR] vocoder.c:177: error: 'struct bandpass' has no member named 'mid2'
[5-ERROR] vocoder.c:178: error: 'struct bandpass' has no member named 'y'
[5-ERROR] vocoder.c:178: error: 'struct bandpass' has no member named 'high2'
[5-ERROR] vocoder.c:178: error: 'struct bandpass' has no member named 'att'
[5-ERROR] vocoder.c: At top level:
[5-ERROR] vocoder.c:184: error: expected ')' before 'Instance'
[5-ERROR] vocoder.c:261: error: expected ')' before 'Instance'
[5-ERROR] vocoder.c:270: error: expected '=', ',', ';', 'asm' or '__attribute__' before '*
' token
[5-ERROR] vocoder.c: In function '_init':
[5-ERROR] vocoder.c:279: error: 'LADSPA_PortDescriptor' undeclared (first use in this func
tion)
[5-ERROR] vocoder.c:279: error: 'piPortDescriptors' undeclared (first use in this function
)
[5-ERROR] vocoder.c:280: error: 'LADSPA_PortRangeHint' undeclared (first use in this funct
ion)
[5-ERROR] vocoder.c:280: error: 'psPortRangeHints' undeclared (first use in this function)
[5-ERROR] vocoder.c:283: error: 'g_psDescriptor' undeclared (first use in this function)
[5-ERROR] vocoder.c:283: error: 'LADSPA_Descriptor' undeclared (first use in this function
)
[5-ERROR] vocoder.c:283: error: expected expression before ')' token
[5-ERROR] vocoder.c:288: error: 'LADSPA_PROPERTY_HARD_RT_CAPABLE' undeclared (first use in
 this function)
[5-ERROR] vocoder.c:293: error: expected expression before ')' token
[5-ERROR] vocoder.c:296: error: expected ')' before 'LADSPA_PortDescriptor'
[5-ERROR] cc1: warnings being treated as errors
[5-ERROR] vocoder.c:296: warning: type defaults to 'int' in declaration of 'type name'
[5-ERROR] vocoder.c:298: error: 'LADSPA_PORT_INPUT' undeclared (first use in this function
)
[5-ERROR] vocoder.c:298: error: 'LADSPA_PORT_AUDIO' undeclared (first use in this function
)
[5-ERROR] vocoder.c:302: error: 'LADSPA_PORT_OUTPUT' undeclared (first use in this functio
n)
[5-ERROR] vocoder.c:304: error: 'LADSPA_PORT_CONTROL' undeclared (first use in this functi
on)
[5-ERROR] vocoder.c:313: error: expected expression before ')' token
[5-ERROR] vocoder.c:316: error: expected ')' before 'LADSPA_PortRangeHint'
[5-ERROR] vocoder.c:316: warning: type defaults to 'int' in declaration of 'type name'
[5-ERROR] vocoder.c:321: error: 'LADSPA_HINT_BOUNDED_BELOW' undeclared (first use in this 
function)
[5-ERROR] vocoder.c:321: error: 'LADSPA_HINT_BOUNDED_ABOVE' undeclared (first use in this 
function)
[5-ERROR] vocoder.c:322: error: 'LADSPA_HINT_INTEGER' undeclared (first use in this functi
on)
[5-ERROR] vocoder.c:337: error: 'instantiateVocoder' undeclared (first use in this functio
n)
[5-ERROR] vocoder.c:338: error: 'connectPortToVocoder' undeclared (first use in this funct
ion)
[5-ERROR] vocoder.c:339: error: 'activateVocoder' undeclared (first use in this function)
[5-ERROR] vocoder.c:340: error: 'runVocoder' undeclared (first use in this function)
[5-ERROR] vocoder.c:344: error: 'cleanupVocoder' undeclared (first use in this function)
[5-ERROR] vocoder.c: In function '_fini':
[5-ERROR] vocoder.c:354: error: 'g_psDescriptor' undeclared (first use in this function)
[5-ERROR] vocoder.c:359: error: 'LADSPA_PortDescriptor' undeclared (first use in this func
tion)
[5-ERROR] vocoder.c:359: error: expected expression before ')' token
[5-ERROR] vocoder.c:363: error: 'LADSPA_PortRangeHint' undeclared (first use in this funct
ion)
[5-ERROR] vocoder.c:363: error: expected expression before ')' token
[5-ERROR] vocoder.c: At top level:
[5-ERROR] vocoder.c:372: error: expected '=', ',', ';', 'asm' or '__attribute__' before '*
' token
[5-ERROR] make: *** [vocoder.so] Error 1
[5-ERROR] --- BUILD ERROR ---

[9-ERROR] vocoder.c:176: error: 'struct bandpass' has no member named 'mid2'
[9-ERROR] vocoder.c:176: error: 'struct bandpass' has no member named 'high2'
[9-ERROR] vocoder.c:176: error: 'struct bandpass' has no member named 'c'
[9-ERROR] vocoder.c:177: error: 'struct bandpass' has no member named 'low2'
[9-ERROR] vocoder.c:177: error: 'struct bandpass' has no member named 'mid2'
[9-ERROR] vocoder.c:178: error: 'struct bandpass' has no member named 'y'
[9-ERROR] vocoder.c:178: error: 'struct bandpass' has no member named 'high2'
[9-ERROR] vocoder.c:178: error: 'struct bandpass' has no member named 'att'
[9-ERROR] vocoder.c: At top level:
[9-ERROR] vocoder.c:184: error: expected ')' before 'Instance'
[9-ERROR] vocoder.c:261: error: expected ')' before 'Instance'
[9-ERROR] vocoder.c:270: error: expected '=', ',', ';', 'asm' or '__attribute__' before '*
' token
[9-ERROR] vocoder.c: In function '_init':
[9-ERROR] vocoder.c:279: error: 'LADSPA_PortDescriptor' undeclared (first use in this func
tion)
[9-ERROR] vocoder.c:279: error: 'piPortDescriptors' undeclared (first use in this function
)
[9-ERROR] vocoder.c:280: error: 'LADSPA_PortRangeHint' undeclared (first use in this funct
ion)
[9-ERROR] vocoder.c:280: error: 'psPortRangeHints' undeclared (first use in this function)
[9-ERROR] vocoder.c:283: error: 'g_psDescriptor' undeclared (first use in this function)
[9-ERROR] vocoder.c:283: error: 'LADSPA_Descriptor' undeclared (first use in this function
)
[9-ERROR] vocoder.c:283: error: expected expression before ')' token
[9-ERROR] vocoder.c:288: error: 'LADSPA_PROPERTY_HARD_RT_CAPABLE' undeclared (first use in
 this function)
[9-ERROR] vocoder.c:293: error: expected expression before ')' token
[9-ERROR] vocoder.c:296: error: expected ')' before 'LADSPA_PortDescriptor'
[9-ERROR] cc1: warnings being treated as errors
[9-ERROR] vocoder.c:296: warning: type defaults to 'int' in declaration of 'type name'
[9-ERROR] vocoder.c:298: error: 'LADSPA_PORT_INPUT' undeclared (first use in this function
)
[9-ERROR] vocoder.c:298: error: 'LADSPA_PORT_AUDIO' undeclared (first use in this function
)
[9-ERROR] vocoder.c:302: error: 'LADSPA_PORT_OUTPUT' undeclared (first use in this functio
n)
[9-ERROR] vocoder.c:304: error: 'LADSPA_PORT_CONTROL' undeclared (first use in this functi
on)
[9-ERROR] vocoder.c:313: error: expected expression before ')' token
[9-ERROR] vocoder.c:316: error: expected ')' before 'LADSPA_PortRangeHint'
[9-ERROR] vocoder.c:316: warning: type defaults to 'int' in declaration of 'type name'
[9-ERROR] vocoder.c:321: error: 'LADSPA_HINT_BOUNDED_BELOW' undeclared (first use in this 
function)
[9-ERROR] vocoder.c:321: error: 'LADSPA_HINT_BOUNDED_ABOVE' undeclared (first use in this 
function)
[9-ERROR] vocoder.c:322: error: 'LADSPA_HINT_INTEGER' undeclared (first use in this functi
on)
[9-ERROR] vocoder.c:337: error: 'instantiateVocoder' undeclared (first use in this functio
n)
[9-ERROR] vocoder.c:338: error: 'connectPortToVocoder' undeclared (first use in this funct
ion)
[9-ERROR] vocoder.c:339: error: 'activateVocoder' undeclared (first use in this function)
[9-ERROR] vocoder.c:340: error: 'runVocoder' undeclared (first use in this function)
[9-ERROR] vocoder.c:344: error: 'cleanupVocoder' undeclared (first use in this function)
[9-ERROR] vocoder.c: In function '_fini':
[9-ERROR] vocoder.c:354: error: 'g_psDescriptor' undeclared (first use in this function)
[9-ERROR] vocoder.c:359: error: 'LADSPA_PortDescriptor' undeclared (first use in this func
tion)
[9-ERROR] vocoder.c:359: error: expected expression before ')' token
[9-ERROR] vocoder.c:363: error: 'LADSPA_PortRangeHint' undeclared (first use in this funct
ion)
[9-ERROR] vocoder.c:363: error: expected expression before ')' token
[9-ERROR] vocoder.c: At top level:
[9-ERROR] vocoder.c:372: error: expected '=', ',', ';', 'asm' or '__attribute__' before '*
' token
[9-ERROR] make: *** [vocoder.so] Error 1
[9-ERROR] --- BUILD ERROR ---