Package description for 'mjpegtools'

Programs for MJPEG recording and playback

 The MJPEG-tools are a basic set of utilities for recording, editing,
 playing back and encoding (to mpeg) video under linux. Recording can
 be done with zoran-based MJPEG-boards (LML33, Iomega Buz, Pinnacle
 DC10(+), Marvel G200/G400), these can also playback video using the
 hardware. With the rest of the tools, this video can be edited and
 encoded into mpeg1/2 or divx video.

Various other information for package 'mjpegtools'   (Repository 'tibit')

URL: http://mjpeg.sf.net/

Author: Gernot Ziegler <madmac@users.sourceforge.net>
Maintainer: Tilmann Bitterberg <transcode@tibit.org>

License: GPL
Status: Stable
Version: 1.8.0

Download: http://dl.sourceforge.net/sourceforge/mjpeg/ mjpegtools-1.8.0.tar.gz

Buildtime: 16536 (5) ERROR seconds (on reference hardware)
Buildtime: 16651 (9) ERROR seconds (on reference hardware)
Buildtime: 16601 (5) ERROR seconds (on reference hardware)
Buildtime: 16234 (9) ERROR seconds (on reference hardware)
Buildtime: 16474 (5) ERROR seconds (on reference hardware)
Buildtime: 16107 (9) ERROR seconds (on reference hardware)

ROCK Sources:  hotfixes.patchmjpegtools.cachemjpegtools.confmjpegtools.desc

Error Logs

[5-ERROR] Making all in y4mdenoise
[5-ERROR] make[2]: Entering directory `/ROCK/loop/src.mjpegtools.1181944665.21836.17176515
10/mjpegtools-1.8.0/y4mdenoise'
[5-ERROR] if gcc-42 -DHAVE_CONFIG_H -I. -I. -I.. -I.. -I/usr/include -I../utils   -DNDEBUG
 -finline-functions -fno-PIC -march=i386 -mcpu=i386 -g -O2 -pthread -Wall -Wunused -MT mai
n.o -MD -MP -MF ".deps/main.Tpo" -c -o main.o main.c; \
[5-ERROR] 	then mv -f ".deps/main.Tpo" ".deps/main.Po"; else rm -f ".deps/main.Tpo"; 
exit 1; fi
[5-ERROR] if g++-42 -DHAVE_CONFIG_H -I. -I. -I.. -I.. -I/usr/include -I../utils   -DNDEBUG
 -finline-functions -fno-PIC -march=i386 -mcpu=i386 -g -O2 -pthread  -MT newdenoise.o -MD 
-MP -MF ".deps/newdenoise.Tpo" -c -o newdenoise.o newdenoise.cc; \
[5-ERROR] 	then mv -f ".deps/newdenoise.Tpo" ".deps/newdenoise.Po"; else rm -f ".deps
/newdenoise.Tpo"; exit 1; fi
[5-ERROR] /bin/sh ../libtool --tag=CXX --mode=link g++-42 -DNDEBUG -finline-functions -fno
-PIC -march=i386 -mcpu=i386 -g -O2 -pthread    -o y4mdenoise  main.o newdenoise.o ../utils
/libmjpegutils.la  -lm 
[5-ERROR] mkdir .libs
[5-ERROR] g++-42 -DNDEBUG -finline-functions -fno-PIC -march=i386 -mcpu=i386 -g -O2 -pthre
ad -o .libs/y4mdenoise main.o newdenoise.o  ../utils/.libs/libmjpegutils.so -lm
[5-ERROR] creating y4mdenoise
[5-ERROR] if g++-42 -DHAVE_CONFIG_H -I. -I. -I.. -I.. -I/usr/include -I../utils   -DNDEBUG
 -finline-functions -fno-PIC -march=i386 -mcpu=i386 -g -O2 -pthread  -MT regiontest.o -MD 
-MP -MF ".deps/regiontest.Tpo" -c -o regiontest.o regiontest.cc; \
[5-ERROR] 	then mv -f ".deps/regiontest.Tpo" ".deps/regiontest.Po"; else rm -f ".deps
/regiontest.Tpo"; exit 1; fi
[5-ERROR] In file included from SetRegion2D.hh:12,
[5-ERROR]                  from regiontest.cc:3:
[5-ERROR] Region2D.hh: In member function 'void Region2D::Move(REGION&)':
[5-ERROR] Region2D.hh:155: error: there are no arguments to 'assert' that depend on a temp
late parameter, so a declaration of 'assert' must be available
[5-ERROR] Region2D.hh:155: error: (if you use '-fpermissive', G++ will accept your code, b
ut allowing the use of an undeclared name is deprecated)
[5-ERROR] Region2D.hh: In constructor 'Region2D::Region2D(Status_t&, const RE
GION&)':
[5-ERROR] Region2D.hh:356: error: there are no arguments to 'assert' that depend on a temp
late parameter, so a declaration of 'assert' must be available
[5-ERROR] Region2D.hh: In member function 'void Region2D::Assign(Status_t&, c
onst REGION&)':
[5-ERROR] Region2D.hh:380: error: there are no arguments to 'assert' that depend on a temp
late parameter, so a declaration of 'assert' must be available
[5-ERROR] Region2D.hh: In member function 'void Region2D::UnionDebug(Status_t
&, INDEX, INDEX, INDEX, REGION_TEMP&)':
[5-ERROR] Region2D.hh:419: error: there are no arguments to 'assert' that depend on a temp
late parameter, so a declaration of 'assert' must be available
[5-ERROR] Region2D.hh:480: error: there are no arguments to 'assert' that depend on a temp
late parameter, so a declaration of 'assert' must be available
[5-ERROR] Region2D.hh: In member function 'void Region2D::Union(Status_t&, co
nst REGION&)':
[5-ERROR] Region2D.hh:497: error: there are no arguments to 'assert' that depend on a temp
late parameter, so a declaration of 'assert' must be available
[5-ERROR] Region2D.hh: In member function 'void Region2D::UnionDebug(Status_t
&, REGION_O&, REGION_TEMP&)':
[5-ERROR] Region2D.hh:530: error: there are no arguments to 'assert' that depend on a temp
late parameter, so a declaration of 'assert' must be available
[5-ERROR] Region2D.hh:596: error: there are no arguments to 'assert' that depend on a temp
late parameter, so a declaration of 'assert' must be available
[5-ERROR] Region2D.hh: In member function 'void Region2D::Subtract(Status_t&,
 const REGION&)':
[5-ERROR] Region2D.hh:614: error: there are no arguments to 'assert' that depend on a temp
late parameter, so a declaration of 'assert' must be available
[5-ERROR] Region2D.hh: In member function 'void Region2D::SubtractDebug(Statu
s_t&, REGION_O&, REGION_TEMP&)':
[5-ERROR] Region2D.hh:648: error: there are no arguments to 'assert' that depend on a temp
late parameter, so a declaration of 'assert' must be available
[5-ERROR] Region2D.hh:717: error: there are no arguments to 'assert' that depend on a temp
late parameter, so a declaration of 'assert' must be available
[5-ERROR] Region2D.hh: In member function 'void Region2D::FloodFill(Status_t&
, CONTROL&, bool)':
[5-ERROR] Region2D.hh:735: error: there are no arguments to 'assert' that depend on a temp
late parameter, so a declaration of 'assert' must be available
[5-ERROR] Region2D.hh: In member function 'void Region2D::MakeBorder(Status_t
&, const REGION&)':
[5-ERROR] Region2D.hh:888: error: there are no arguments to 'assert' that depend on a temp
late parameter, so a declaration of 'assert' must be available
[5-ERROR] Region2D.hh: In member function 'void Region2D::UnionSurroundingExt
ents(Status_t&, INDEX, INDEX, INDEX)':
[5-ERROR] Region2D.hh:922: error: there are no arguments to 'assert' that depend on a temp
late parameter, so a declaration of 'assert' must be available
[5-ERROR] Region2D.hh: In constructor 'Region2D::FloodFillControl::Fl
oodFillControl(Status_t&)':
[5-ERROR] Region2D.hh:978: error: there are no arguments to 'assert' that depend on a temp
late parameter, so a declaration of 'assert' must be available
[5-ERROR] Region2D.hh: In member function 'void Region2D::FloodFillControl::Init(Status_t&)':
[5-ERROR] Region2D.hh:996: error: there are no arguments to 'assert' that depend on a temp
late parameter, so a declaration of 'assert' must be available
[5-ERROR] make[2]: *** [regiontest.o] Error 1
[5-ERROR] make[2]: Leaving directory `/ROCK/loop/src.mjpegtools.1181944665.21836.171765151
0/mjpegtools-1.8.0/y4mdenoise'
[5-ERROR] make[1]: *** [all-recursive] Error 1
[5-ERROR] make[1]: Leaving directory `/ROCK/loop/src.mjpegtools.1181944665.21836.171765151
0/mjpegtools-1.8.0'
[5-ERROR] make: *** [all] Error 2
[5-ERROR] --- BUILD ERROR ---

[9-ERROR] Making all in y4mdenoise
[9-ERROR] make[2]: Entering directory `/ROCK/loop/src.mjpegtools.1181965577.14043.33070083
18/mjpegtools-1.8.0/y4mdenoise'
[9-ERROR] if gcc-42 -DHAVE_CONFIG_H -I. -I. -I.. -I.. -I/usr/include -I../utils   -DNDEBUG
 -finline-functions -fno-PIC -march=i386 -mcpu=i386 -g -O2 -pthread -Wall -Wunused -MT mai
n.o -MD -MP -MF ".deps/main.Tpo" -c -o main.o main.c; \
[9-ERROR] 	then mv -f ".deps/main.Tpo" ".deps/main.Po"; else rm -f ".deps/main.Tpo"; 
exit 1; fi
[9-ERROR] if g++-42 -DHAVE_CONFIG_H -I. -I. -I.. -I.. -I/usr/include -I../utils   -DNDEBUG
 -finline-functions -fno-PIC -march=i386 -mcpu=i386 -g -O2 -pthread  -MT newdenoise.o -MD 
-MP -MF ".deps/newdenoise.Tpo" -c -o newdenoise.o newdenoise.cc; \
[9-ERROR] 	then mv -f ".deps/newdenoise.Tpo" ".deps/newdenoise.Po"; else rm -f ".deps
/newdenoise.Tpo"; exit 1; fi
[9-ERROR] /bin/sh ../libtool --tag=CXX --mode=link g++-42 -DNDEBUG -finline-functions -fno
-PIC -march=i386 -mcpu=i386 -g -O2 -pthread    -o y4mdenoise  main.o newdenoise.o ../utils
/libmjpegutils.la  -lm 
[9-ERROR] mkdir .libs
[9-ERROR] g++-42 -DNDEBUG -finline-functions -fno-PIC -march=i386 -mcpu=i386 -g -O2 -pthre
ad -o .libs/y4mdenoise main.o newdenoise.o  ../utils/.libs/libmjpegutils.so -lm
[9-ERROR] creating y4mdenoise
[9-ERROR] if g++-42 -DHAVE_CONFIG_H -I. -I. -I.. -I.. -I/usr/include -I../utils   -DNDEBUG
 -finline-functions -fno-PIC -march=i386 -mcpu=i386 -g -O2 -pthread  -MT regiontest.o -MD 
-MP -MF ".deps/regiontest.Tpo" -c -o regiontest.o regiontest.cc; \
[9-ERROR] 	then mv -f ".deps/regiontest.Tpo" ".deps/regiontest.Po"; else rm -f ".deps
/regiontest.Tpo"; exit 1; fi
[9-ERROR] In file included from SetRegion2D.hh:12,
[9-ERROR]                  from regiontest.cc:3:
[9-ERROR] Region2D.hh: In member function 'void Region2D::Move(REGION&)':
[9-ERROR] Region2D.hh:155: error: there are no arguments to 'assert' that depend on a temp
late parameter, so a declaration of 'assert' must be available
[9-ERROR] Region2D.hh:155: error: (if you use '-fpermissive', G++ will accept your code, b
ut allowing the use of an undeclared name is deprecated)
[9-ERROR] Region2D.hh: In constructor 'Region2D::Region2D(Status_t&, const RE
GION&)':
[9-ERROR] Region2D.hh:356: error: there are no arguments to 'assert' that depend on a temp
late parameter, so a declaration of 'assert' must be available
[9-ERROR] Region2D.hh: In member function 'void Region2D::Assign(Status_t&, c
onst REGION&)':
[9-ERROR] Region2D.hh:380: error: there are no arguments to 'assert' that depend on a temp
late parameter, so a declaration of 'assert' must be available
[9-ERROR] Region2D.hh: In member function 'void Region2D::UnionDebug(Status_t
&, INDEX, INDEX, INDEX, REGION_TEMP&)':
[9-ERROR] Region2D.hh:419: error: there are no arguments to 'assert' that depend on a temp
late parameter, so a declaration of 'assert' must be available
[9-ERROR] Region2D.hh:480: error: there are no arguments to 'assert' that depend on a temp
late parameter, so a declaration of 'assert' must be available
[9-ERROR] Region2D.hh: In member function 'void Region2D::Union(Status_t&, co
nst REGION&)':
[9-ERROR] Region2D.hh:497: error: there are no arguments to 'assert' that depend on a temp
late parameter, so a declaration of 'assert' must be available
[9-ERROR] Region2D.hh: In member function 'void Region2D::UnionDebug(Status_t
&, REGION_O&, REGION_TEMP&)':
[9-ERROR] Region2D.hh:530: error: there are no arguments to 'assert' that depend on a temp
late parameter, so a declaration of 'assert' must be available
[9-ERROR] Region2D.hh:596: error: there are no arguments to 'assert' that depend on a temp
late parameter, so a declaration of 'assert' must be available
[9-ERROR] Region2D.hh: In member function 'void Region2D::Subtract(Status_t&,
 const REGION&)':
[9-ERROR] Region2D.hh:614: error: there are no arguments to 'assert' that depend on a temp
late parameter, so a declaration of 'assert' must be available
[9-ERROR] Region2D.hh: In member function 'void Region2D::SubtractDebug(Statu
s_t&, REGION_O&, REGION_TEMP&)':
[9-ERROR] Region2D.hh:648: error: there are no arguments to 'assert' that depend on a temp
late parameter, so a declaration of 'assert' must be available
[9-ERROR] Region2D.hh:717: error: there are no arguments to 'assert' that depend on a temp
late parameter, so a declaration of 'assert' must be available
[9-ERROR] Region2D.hh: In member function 'void Region2D::FloodFill(Status_t&
, CONTROL&, bool)':
[9-ERROR] Region2D.hh:735: error: there are no arguments to 'assert' that depend on a temp
late parameter, so a declaration of 'assert' must be available
[9-ERROR] Region2D.hh: In member function 'void Region2D::MakeBorder(Status_t
&, const REGION&)':
[9-ERROR] Region2D.hh:888: error: there are no arguments to 'assert' that depend on a temp
late parameter, so a declaration of 'assert' must be available
[9-ERROR] Region2D.hh: In member function 'void Region2D::UnionSurroundingExt
ents(Status_t&, INDEX, INDEX, INDEX)':
[9-ERROR] Region2D.hh:922: error: there are no arguments to 'assert' that depend on a temp
late parameter, so a declaration of 'assert' must be available
[9-ERROR] Region2D.hh: In constructor 'Region2D::FloodFillControl::Fl
oodFillControl(Status_t&)':
[9-ERROR] Region2D.hh:978: error: there are no arguments to 'assert' that depend on a temp
late parameter, so a declaration of 'assert' must be available
[9-ERROR] Region2D.hh: In member function 'void Region2D::FloodFillControl::Init(Status_t&)':
[9-ERROR] Region2D.hh:996: error: there are no arguments to 'assert' that depend on a temp
late parameter, so a declaration of 'assert' must be available
[9-ERROR] make[2]: *** [regiontest.o] Error 1
[9-ERROR] make[2]: Leaving directory `/ROCK/loop/src.mjpegtools.1181965577.14043.330700831
8/mjpegtools-1.8.0/y4mdenoise'
[9-ERROR] make[1]: *** [all-recursive] Error 1
[9-ERROR] make[1]: Leaving directory `/ROCK/loop/src.mjpegtools.1181965577.14043.330700831
8/mjpegtools-1.8.0'
[9-ERROR] make: *** [all] Error 2
[9-ERROR] --- BUILD ERROR ---