Package description for 'mythtv-plugins'

the default plugin-collection for MythTV

 This plugin plugin package for MythTV consists of the former packages
 mythbrowser, mythdvd, mythgallery, mythgame, mythmysuc, mythnews,
 mythphone, mythvideo mythweather and mythweb.

Various other information for package 'mythtv-plugins'   (Repository 'fake')

URL: http://www.mythtv.org

Author: John Danner <johndanner@untzuntz.com>
Maintainer: fake <fake@rapidnetworks.de>

License: GPL
Status: Stable
Version: 0.19

Download: http://www.mythtv.org/mc/ mythplugins-0.19.tar.bz2

Buildtime: 2020 (5) ERROR seconds (on reference hardware)
Buildtime: 2088 (9) ERROR seconds (on reference hardware)
Buildtime: 2113 (5) ERROR seconds (on reference hardware)
Buildtime: 2014 (9) ERROR seconds (on reference hardware)
Buildtime: 2011 (5) ERROR seconds (on reference hardware)
Buildtime: 2011 (9) ERROR seconds (on reference hardware)

ROCK Sources:  mythtv-plugins.cachemythtv-plugins.confmythtv-plugins.desc

Error Logs

[5-ERROR]         FFTW          support will not be included in MythMusic
[5-ERROR]         SDL           support will be included in MythMusic
[5-ERROR]         AAC           support will not be included in MythMusic
[5-ERROR]         FESTIVAL      support will not be included in MythPhone
[5-ERROR] 
[5-ERROR] cd mythbrowser && qmake mythbrowser.pro "PREFIX=/opt/mythtv" -o Makefile
[5-ERROR] cd mythbrowser && make -f Makefile
[5-ERROR] make[1]: Entering directory `/ROCK/loop/src.mythtv-plugins.1181951676.30303.4161
569442/mythplugins-0.19/mythbrowser'
[5-ERROR] cd mythbrowser && qmake mythbrowser.pro "PREFIX=/opt/mythtv" -o Makefile
[5-ERROR] cd mythbrowser && make -f Makefile
[5-ERROR] make[2]: Entering directory `/ROCK/loop/src.mythtv-plugins.1181951676.30303.4161
569442/mythplugins-0.19/mythbrowser/mythbrowser'
[5-ERROR] g++-42 -c -pipe -Wall -W -fomit-frame-pointer -D_REENTRANT  -D_GNU_SOURCE -DPREF
IX=\"/opt/mythtv\" -D_FILE_OFFSET_BITS=64 -DQT_NO_DEBUG -DQT_THREAD_SUPPORT -DQT_SHARED -I
/opt/qt33/mkspecs/default -I. -I/opt/mythtv/include -I/usr/kde/3.3/include -I/opt/mythtv/i
nclude -I/usr/include/kde -I/opt/kde3/include -I/opt/qt33/include -o main.o main.cpp
[5-ERROR] In file included from main.cpp:18:
[5-ERROR] tabview.h:14:32: error: mythtv/mythdialogs.h: No such file or directory
[5-ERROR] main.cpp:20:30: error: mythtv/exitcodes.h: No such file or directory
[5-ERROR] main.cpp:21:32: error: mythtv/mythcontext.h: No such file or directory
[5-ERROR] main.cpp:22:30: error: mythtv/mythdbcon.h: No such file or directory
[5-ERROR] main.cpp:23:33: error: mythtv/langsettings.h: No such file or directory
[5-ERROR] In file included from main.cpp:18:
[5-ERROR] tabview.h:22: error: expected class-name before '{' token
[5-ERROR] tabview.h:29: error: 'WFlags' has not been declared
[5-ERROR] tabview.h:61: error: 'WFlags' does not name a type
[5-ERROR] tabview.h:71: error: ISO C++ forbids declaration of 'MythPopupBox' with no type
[5-ERROR] tabview.h:71: error: expected ';' before '*' token
[5-ERROR] tabview.h:78: error: 'ButtonState' does not name a type
[5-ERROR] main.cpp: In function 'void setupKeys()':
[5-ERROR] main.cpp:39: error: 'REG_KEY' was not declared in this scope
[5-ERROR] main.cpp: In function 'int main(int, char**)':
[5-ERROR] main.cpp:85: error: 'gContext' was not declared in this scope
[5-ERROR] main.cpp:86: error: expected type-specifier before 'MythContext'
[5-ERROR] main.cpp:86: error: expected `;' before 'MythContext'
[5-ERROR] main.cpp:89: error: 'VB_IMPORTANT' was not declared in this scope
[5-ERROR] main.cpp:89: error: 'VERBOSE' was not declared in this scope
[5-ERROR] main.cpp:90: error: 'FRONTEND_EXIT_NO_MYTHCONTEXT' was not declared in this scop
e
[5-ERROR] main.cpp:93: error: 'MSqlQuery' has not been declared
[5-ERROR] main.cpp:95: error: 'VB_IMPORTANT' was not declared in this scope
[5-ERROR] main.cpp:95: error: 'VERBOSE' was not declared in this scope
[5-ERROR] main.cpp:96: error: 'FRONTEND_EXIT_DB_ERROR' was not declared in this scope
[5-ERROR] main.cpp:99: error: 'LanguageSettings' has not been declared
[5-ERROR] main.cpp:115: error: no matching function for call to 'KApplication::setMainWidg
et(TabView*&)'
[5-ERROR] /opt/qt33/include/qapplication.h:119: note: candidates are: virtual void QApplic
ation::setMainWidget(QWidget*)
[5-ERROR] main.cpp:116: error: 'class TabView' has no member named 'setGeometry'
[5-ERROR] main.cpp:117: error: 'class TabView' has no member named 'setFixedSize'
[5-ERROR] main.cpp:118: error: 'class TabView' has no member named 'Show'
[5-ERROR] make[2]: *** [main.o] Error 1
[5-ERROR] make[2]: Leaving directory `/ROCK/loop/src.mythtv-plugins.1181951676.30303.41615
69442/mythplugins-0.19/mythbrowser/mythbrowser'
[5-ERROR] make[1]: *** [sub-mythbrowser] Error 2
[5-ERROR] make[1]: Leaving directory `/ROCK/loop/src.mythtv-plugins.1181951676.30303.41615
69442/mythplugins-0.19/mythbrowser'
[5-ERROR] make: *** [sub-mythbrowser] Error 2
[5-ERROR] --- BUILD ERROR ---

[9-ERROR]         FFTW          support will not be included in MythMusic
[9-ERROR]         SDL           support will be included in MythMusic
[9-ERROR]         AAC           support will not be included in MythMusic
[9-ERROR]         FESTIVAL      support will not be included in MythPhone
[9-ERROR] 
[9-ERROR] cd mythbrowser && qmake mythbrowser.pro "PREFIX=/opt/mythtv" -o Makefile
[9-ERROR] cd mythbrowser && make -f Makefile
[9-ERROR] make[1]: Entering directory `/ROCK/loop/src.mythtv-plugins.1181973210.1159.29388
99655/mythplugins-0.19/mythbrowser'
[9-ERROR] cd mythbrowser && qmake mythbrowser.pro "PREFIX=/opt/mythtv" -o Makefile
[9-ERROR] cd mythbrowser && make -f Makefile
[9-ERROR] make[2]: Entering directory `/ROCK/loop/src.mythtv-plugins.1181973210.1159.29388
99655/mythplugins-0.19/mythbrowser/mythbrowser'
[9-ERROR] g++-42 -c -pipe -Wall -W -fomit-frame-pointer -D_REENTRANT  -D_GNU_SOURCE -DPREF
IX=\"/opt/mythtv\" -D_FILE_OFFSET_BITS=64 -DQT_NO_DEBUG -DQT_THREAD_SUPPORT -DQT_SHARED -I
/opt/qt33/mkspecs/default -I. -I/opt/mythtv/include -I/usr/kde/3.3/include -I/opt/mythtv/i
nclude -I/usr/include/kde -I/opt/kde3/include -I/opt/qt33/include -o main.o main.cpp
[9-ERROR] In file included from main.cpp:18:
[9-ERROR] tabview.h:14:32: error: mythtv/mythdialogs.h: No such file or directory
[9-ERROR] main.cpp:20:30: error: mythtv/exitcodes.h: No such file or directory
[9-ERROR] main.cpp:21:32: error: mythtv/mythcontext.h: No such file or directory
[9-ERROR] main.cpp:22:30: error: mythtv/mythdbcon.h: No such file or directory
[9-ERROR] main.cpp:23:33: error: mythtv/langsettings.h: No such file or directory
[9-ERROR] In file included from main.cpp:18:
[9-ERROR] tabview.h:22: error: expected class-name before '{' token
[9-ERROR] tabview.h:29: error: 'WFlags' has not been declared
[9-ERROR] tabview.h:61: error: 'WFlags' does not name a type
[9-ERROR] tabview.h:71: error: ISO C++ forbids declaration of 'MythPopupBox' with no type
[9-ERROR] tabview.h:71: error: expected ';' before '*' token
[9-ERROR] tabview.h:78: error: 'ButtonState' does not name a type
[9-ERROR] main.cpp: In function 'void setupKeys()':
[9-ERROR] main.cpp:39: error: 'REG_KEY' was not declared in this scope
[9-ERROR] main.cpp: In function 'int main(int, char**)':
[9-ERROR] main.cpp:85: error: 'gContext' was not declared in this scope
[9-ERROR] main.cpp:86: error: expected type-specifier before 'MythContext'
[9-ERROR] main.cpp:86: error: expected `;' before 'MythContext'
[9-ERROR] main.cpp:89: error: 'VB_IMPORTANT' was not declared in this scope
[9-ERROR] main.cpp:89: error: 'VERBOSE' was not declared in this scope
[9-ERROR] main.cpp:90: error: 'FRONTEND_EXIT_NO_MYTHCONTEXT' was not declared in this scop
e
[9-ERROR] main.cpp:93: error: 'MSqlQuery' has not been declared
[9-ERROR] main.cpp:95: error: 'VB_IMPORTANT' was not declared in this scope
[9-ERROR] main.cpp:95: error: 'VERBOSE' was not declared in this scope
[9-ERROR] main.cpp:96: error: 'FRONTEND_EXIT_DB_ERROR' was not declared in this scope
[9-ERROR] main.cpp:99: error: 'LanguageSettings' has not been declared
[9-ERROR] main.cpp:115: error: no matching function for call to 'KApplication::setMainWidg
et(TabView*&)'
[9-ERROR] /opt/qt33/include/qapplication.h:119: note: candidates are: virtual void QApplic
ation::setMainWidget(QWidget*)
[9-ERROR] main.cpp:116: error: 'class TabView' has no member named 'setGeometry'
[9-ERROR] main.cpp:117: error: 'class TabView' has no member named 'setFixedSize'
[9-ERROR] main.cpp:118: error: 'class TabView' has no member named 'Show'
[9-ERROR] make[2]: *** [main.o] Error 1
[9-ERROR] make[2]: Leaving directory `/ROCK/loop/src.mythtv-plugins.1181973210.1159.293889
9655/mythplugins-0.19/mythbrowser/mythbrowser'
[9-ERROR] make[1]: *** [sub-mythbrowser] Error 2
[9-ERROR] make[1]: Leaving directory `/ROCK/loop/src.mythtv-plugins.1181973210.1159.293889
9655/mythplugins-0.19/mythbrowser'
[9-ERROR] make: *** [sub-mythbrowser] Error 2
[9-ERROR] --- BUILD ERROR ---