Package description for 'vice'

commodre emulator

 Vice is a commodore emulator.

Various other information for package 'vice'   (Repository 'misc')

URL: http://viceteam.bei.t-online.de/

Author: Andreas Boose <viceteam@t-online.de>
Maintainer: Eric Heaton <eric.heaton2@btinternet.com>

License: GPL
Status: Stable
Version: 1.13

Download: ftp://ftp.funet.fi/pub/cbm/crossplatform/emulators/VICE/ vice-1.13.tar.gz

Buildtime: 10474 (5) ERROR seconds (on reference hardware)
Buildtime: 10202 (9) ERROR seconds (on reference hardware)
Buildtime: 10202 (5) ERROR seconds (on reference hardware)
Buildtime: 10130 (9) ERROR seconds (on reference hardware)
Buildtime: 10408 (5) ERROR seconds (on reference hardware)
Buildtime: 9983 (9) ERROR seconds (on reference hardware)

ROCK Sources:  hotfix-binutils-gcc.patchvice.cachevice.desc

Error Logs

[5-ERROR] if gcc-42 -DHAVE_CONFIG_H -I. -I. -I../../../src -I../../../src/arch/unix -I../.
./../src -I../../../src -I../../../src/c64 -I../../../src/vicii  -I/usr/X11R7/include  -g 
-O5 -DNO_REGPARM -Wall -Wstrict-prototypes -Winline -MT supersnapshot.o -MD -MP -MF ".deps
/supersnapshot.Tpo" \
[5-ERROR] 	  -c -o supersnapshot.o `test -f 'supersnapshot.c' || echo './'`supersnaps
hot.c; \
[5-ERROR] 	then mv ".deps/supersnapshot.Tpo" ".deps/supersnapshot.Po"; \
[5-ERROR] 	else rm -f ".deps/supersnapshot.Tpo"; exit 1; \
[5-ERROR] 	fi
[5-ERROR] if gcc-42 -DHAVE_CONFIG_H -I. -I. -I../../../src -I../../../src/arch/unix -I../.
./../src -I../../../src -I../../../src/c64 -I../../../src/vicii  -I/usr/X11R7/include  -g 
-O5 -DNO_REGPARM -Wall -Wstrict-prototypes -Winline -MT zaxxon.o -MD -MP -MF ".deps/zaxxon
.Tpo" \
[5-ERROR] 	  -c -o zaxxon.o `test -f 'zaxxon.c' || echo './'`zaxxon.c; \
[5-ERROR] 	then mv ".deps/zaxxon.Tpo" ".deps/zaxxon.Po"; \
[5-ERROR] 	else rm -f ".deps/zaxxon.Tpo"; exit 1; \
[5-ERROR] 	fi
[5-ERROR] rm -f libc64cart.a
[5-ERROR] ar cru libc64cart.a actionreplay.o atomicpower.o c64cart.o c64cartmem.o crt.o ep
yxfastload.o expert.o final.o generic.o ide64.o kcs.o retroreplay.o supergames.o supersnap
shot.o zaxxon.o 
[5-ERROR] ranlib libc64cart.a
[5-ERROR] make[5]: Leaving directory `/ROCK/loop/src.vice.1181947880.28565.2847972068/vice
-1.13/src/c64/cart'
[5-ERROR] make[5]: Entering directory `/ROCK/loop/src.vice.1181947880.28565.2847972068/vic
e-1.13/src/c64'
[5-ERROR] if gcc-42 -DHAVE_CONFIG_H -I. -I. -I../../src -I../../src/arch/unix -I../../src 
-I../../src -I../../src/drive -I../../src/sid -I../../src/tape -I../../src/vicii  -I/usr/X
11R7/include  -g -O5 -DNO_REGPARM -Wall -Wstrict-prototypes -Winline -MT c64-cmdline-optio
ns.o -MD -MP -MF ".deps/c64-cmdline-options.Tpo" \
[5-ERROR] 	  -c -o c64-cmdline-options.o `test -f 'c64-cmdline-options.c' || echo './
'`c64-cmdline-options.c; \
[5-ERROR] 	then mv ".deps/c64-cmdline-options.Tpo" ".deps/c64-cmdline-options.Po"; \
[5-ERROR] 	else rm -f ".deps/c64-cmdline-options.Tpo"; exit 1; \
[5-ERROR] 	fi
[5-ERROR] if gcc-42 -DHAVE_CONFIG_H -I. -I. -I../../src -I../../src/arch/unix -I../../src 
-I../../src -I../../src/drive -I../../src/sid -I../../src/tape -I../../src/vicii  -I/usr/X
11R7/include  -g -O5 -DNO_REGPARM -Wall -Wstrict-prototypes -Winline -MT c64-resources.o -
MD -MP -MF ".deps/c64-resources.Tpo" \
[5-ERROR] 	  -c -o c64-resources.o `test -f 'c64-resources.c' || echo './'`c64-resour
ces.c; \
[5-ERROR] 	then mv ".deps/c64-resources.Tpo" ".deps/c64-resources.Po"; \
[5-ERROR] 	else rm -f ".deps/c64-resources.Tpo"; exit 1; \
[5-ERROR] 	fi
[5-ERROR] if gcc-42 -DHAVE_CONFIG_H -I. -I. -I../../src -I../../src/arch/unix -I../../src 
-I../../src -I../../src/drive -I../../src/sid -I../../src/tape -I../../src/vicii  -I/usr/X
11R7/include  -g -O5 -DNO_REGPARM -Wall -Wstrict-prototypes -Winline -MT c64-snapshot.o -M
D -MP -MF ".deps/c64-snapshot.Tpo" \
[5-ERROR] 	  -c -o c64-snapshot.o `test -f 'c64-snapshot.c' || echo './'`c64-snapshot
.c; \
[5-ERROR] 	then mv ".deps/c64-snapshot.Tpo" ".deps/c64-snapshot.Po"; \
[5-ERROR] 	else rm -f ".deps/c64-snapshot.Tpo"; exit 1; \
[5-ERROR] 	fi
[5-ERROR] if gcc-42 -DHAVE_CONFIG_H -I. -I. -I../../src -I../../src/arch/unix -I../../src 
-I../../src -I../../src/drive -I../../src/sid -I../../src/tape -I../../src/vicii  -I/usr/X
11R7/include  -g -O5 -DNO_REGPARM -Wall -Wstrict-prototypes -Winline -MT c64.o -MD -MP -MF
 ".deps/c64.Tpo" \
[5-ERROR] 	  -c -o c64.o `test -f 'c64.c' || echo './'`c64.c; \
[5-ERROR] 	then mv ".deps/c64.Tpo" ".deps/c64.Po"; \
[5-ERROR] 	else rm -f ".deps/c64.Tpo"; exit 1; \
[5-ERROR] 	fi
[5-ERROR] In file included from c64.c:48:
[5-ERROR] ../../src/arch/unix/c64ui.h:33: error: array type has incomplete element type
[5-ERROR] ../../src/arch/unix/c64ui.h:34: error: array type has incomplete element type
[5-ERROR] make[5]: *** [c64.o] Error 1
[5-ERROR] make[5]: Leaving directory `/ROCK/loop/src.vice.1181947880.28565.2847972068/vice
-1.13/src/c64'
[5-ERROR] make[4]: *** [all-recursive] Error 1
[5-ERROR] make[4]: Leaving directory `/ROCK/loop/src.vice.1181947880.28565.2847972068/vice
-1.13/src/c64'
[5-ERROR] make[3]: *** [all] Error 2
[5-ERROR] make[3]: Leaving directory `/ROCK/loop/src.vice.1181947880.28565.2847972068/vice
-1.13/src/c64'
[5-ERROR] make[2]: *** [all-recursive] Error 1
[5-ERROR] make[2]: Leaving directory `/ROCK/loop/src.vice.1181947880.28565.2847972068/vice
-1.13/src'
[5-ERROR] make[1]: *** [all] Error 2
[5-ERROR] make[1]: Leaving directory `/ROCK/loop/src.vice.1181947880.28565.2847972068/vice
-1.13/src'
[5-ERROR] make: *** [all-recursive] Error 1
[5-ERROR] --- BUILD ERROR ---

[9-ERROR] if gcc-42 -DHAVE_CONFIG_H -I. -I. -I../../../src -I../../../src/arch/unix -I../.
./../src -I../../../src -I../../../src/c64 -I../../../src/vicii  -I/usr/X11R7/include  -g 
-O5 -DNO_REGPARM -Wall -Wstrict-prototypes -Winline -MT supersnapshot.o -MD -MP -MF ".deps
/supersnapshot.Tpo" \
[9-ERROR] 	  -c -o supersnapshot.o `test -f 'supersnapshot.c' || echo './'`supersnaps
hot.c; \
[9-ERROR] 	then mv ".deps/supersnapshot.Tpo" ".deps/supersnapshot.Po"; \
[9-ERROR] 	else rm -f ".deps/supersnapshot.Tpo"; exit 1; \
[9-ERROR] 	fi
[9-ERROR] if gcc-42 -DHAVE_CONFIG_H -I. -I. -I../../../src -I../../../src/arch/unix -I../.
./../src -I../../../src -I../../../src/c64 -I../../../src/vicii  -I/usr/X11R7/include  -g 
-O5 -DNO_REGPARM -Wall -Wstrict-prototypes -Winline -MT zaxxon.o -MD -MP -MF ".deps/zaxxon
.Tpo" \
[9-ERROR] 	  -c -o zaxxon.o `test -f 'zaxxon.c' || echo './'`zaxxon.c; \
[9-ERROR] 	then mv ".deps/zaxxon.Tpo" ".deps/zaxxon.Po"; \
[9-ERROR] 	else rm -f ".deps/zaxxon.Tpo"; exit 1; \
[9-ERROR] 	fi
[9-ERROR] rm -f libc64cart.a
[9-ERROR] ar cru libc64cart.a actionreplay.o atomicpower.o c64cart.o c64cartmem.o crt.o ep
yxfastload.o expert.o final.o generic.o ide64.o kcs.o retroreplay.o supergames.o supersnap
shot.o zaxxon.o 
[9-ERROR] ranlib libc64cart.a
[9-ERROR] make[5]: Leaving directory `/ROCK/loop/src.vice.1181968581.20590.1424038480/vice
-1.13/src/c64/cart'
[9-ERROR] make[5]: Entering directory `/ROCK/loop/src.vice.1181968581.20590.1424038480/vic
e-1.13/src/c64'
[9-ERROR] if gcc-42 -DHAVE_CONFIG_H -I. -I. -I../../src -I../../src/arch/unix -I../../src 
-I../../src -I../../src/drive -I../../src/sid -I../../src/tape -I../../src/vicii  -I/usr/X
11R7/include  -g -O5 -DNO_REGPARM -Wall -Wstrict-prototypes -Winline -MT c64-cmdline-optio
ns.o -MD -MP -MF ".deps/c64-cmdline-options.Tpo" \
[9-ERROR] 	  -c -o c64-cmdline-options.o `test -f 'c64-cmdline-options.c' || echo './
'`c64-cmdline-options.c; \
[9-ERROR] 	then mv ".deps/c64-cmdline-options.Tpo" ".deps/c64-cmdline-options.Po"; \
[9-ERROR] 	else rm -f ".deps/c64-cmdline-options.Tpo"; exit 1; \
[9-ERROR] 	fi
[9-ERROR] if gcc-42 -DHAVE_CONFIG_H -I. -I. -I../../src -I../../src/arch/unix -I../../src 
-I../../src -I../../src/drive -I../../src/sid -I../../src/tape -I../../src/vicii  -I/usr/X
11R7/include  -g -O5 -DNO_REGPARM -Wall -Wstrict-prototypes -Winline -MT c64-resources.o -
MD -MP -MF ".deps/c64-resources.Tpo" \
[9-ERROR] 	  -c -o c64-resources.o `test -f 'c64-resources.c' || echo './'`c64-resour
ces.c; \
[9-ERROR] 	then mv ".deps/c64-resources.Tpo" ".deps/c64-resources.Po"; \
[9-ERROR] 	else rm -f ".deps/c64-resources.Tpo"; exit 1; \
[9-ERROR] 	fi
[9-ERROR] if gcc-42 -DHAVE_CONFIG_H -I. -I. -I../../src -I../../src/arch/unix -I../../src 
-I../../src -I../../src/drive -I../../src/sid -I../../src/tape -I../../src/vicii  -I/usr/X
11R7/include  -g -O5 -DNO_REGPARM -Wall -Wstrict-prototypes -Winline -MT c64-snapshot.o -M
D -MP -MF ".deps/c64-snapshot.Tpo" \
[9-ERROR] 	  -c -o c64-snapshot.o `test -f 'c64-snapshot.c' || echo './'`c64-snapshot
.c; \
[9-ERROR] 	then mv ".deps/c64-snapshot.Tpo" ".deps/c64-snapshot.Po"; \
[9-ERROR] 	else rm -f ".deps/c64-snapshot.Tpo"; exit 1; \
[9-ERROR] 	fi
[9-ERROR] if gcc-42 -DHAVE_CONFIG_H -I. -I. -I../../src -I../../src/arch/unix -I../../src 
-I../../src -I../../src/drive -I../../src/sid -I../../src/tape -I../../src/vicii  -I/usr/X
11R7/include  -g -O5 -DNO_REGPARM -Wall -Wstrict-prototypes -Winline -MT c64.o -MD -MP -MF
 ".deps/c64.Tpo" \
[9-ERROR] 	  -c -o c64.o `test -f 'c64.c' || echo './'`c64.c; \
[9-ERROR] 	then mv ".deps/c64.Tpo" ".deps/c64.Po"; \
[9-ERROR] 	else rm -f ".deps/c64.Tpo"; exit 1; \
[9-ERROR] 	fi
[9-ERROR] In file included from c64.c:48:
[9-ERROR] ../../src/arch/unix/c64ui.h:33: error: array type has incomplete element type
[9-ERROR] ../../src/arch/unix/c64ui.h:34: error: array type has incomplete element type
[9-ERROR] make[5]: *** [c64.o] Error 1
[9-ERROR] make[5]: Leaving directory `/ROCK/loop/src.vice.1181968581.20590.1424038480/vice
-1.13/src/c64'
[9-ERROR] make[4]: *** [all-recursive] Error 1
[9-ERROR] make[4]: Leaving directory `/ROCK/loop/src.vice.1181968581.20590.1424038480/vice
-1.13/src/c64'
[9-ERROR] make[3]: *** [all] Error 2
[9-ERROR] make[3]: Leaving directory `/ROCK/loop/src.vice.1181968581.20590.1424038480/vice
-1.13/src/c64'
[9-ERROR] make[2]: *** [all-recursive] Error 1
[9-ERROR] make[2]: Leaving directory `/ROCK/loop/src.vice.1181968581.20590.1424038480/vice
-1.13/src'
[9-ERROR] make[1]: *** [all] Error 2
[9-ERROR] make[1]: Leaving directory `/ROCK/loop/src.vice.1181968581.20590.1424038480/vice
-1.13/src'
[9-ERROR] make: *** [all-recursive] Error 1
[9-ERROR] --- BUILD ERROR ---