Package description for 'zd1211'

Linux driver for the ZyDAS ZD1211 802.11b/g USB-WLAN-Chip.

 Linux driver for the ZyDAS ZD1211 802.11b/g USB-WLAN-Chip. Initially 
 contributed by ZyDAS, this driver is actively maintained by the open source 
 community.

Various other information for package 'zd1211'   (Repository 'daja77')

URL: http://mutella.sourceforge.net

Author: Max Zaitsev <maksik@users.sourceforge.net>
Maintainer: Daniel Jahre <daja@rocklinux.org>

License: GPL
Status: Beta
Version: 20050822

Download: http://dl.sourceforge.net/sourceforge/zd1211/ sf_zd1211_20050822_src.tar.gz

Buildtime: 1421 (5) ERROR seconds (on reference hardware)
Buildtime: 1414 (9) ERROR seconds (on reference hardware)
Buildtime: 1428 (5) ERROR seconds (on reference hardware)
Buildtime: 1352 (9) ERROR seconds (on reference hardware)
Buildtime: 1394 (5) ERROR seconds (on reference hardware)
Buildtime: 1404 (9) ERROR seconds (on reference hardware)

ROCK Sources:  zd1211-makefile.patchzd1211.cachezd1211.desc

Error Logs

[5-ERROR] INSERT = '-O1 -pipe -march=i486'
[5-ERROR] REMOVE = '-march=* -mcpu=* -O -O[0-9s] -g* -I/usr/local/include -I/usr/include'
[5-ERROR] APPEND = '-s'
[5-ERROR] FILTER = ''
[5-ERROR] Old PATH: /ROCK/src.zd1211.1181951455.18437.4161569442/wrappers:/ROCK/build/ref0
603-TRUNK-x86-reference/ROCK/tools.chroot/wrapper:/ROCK/build/ref0603-TRUNK-x86-reference/
ROCK/tools.chroot/bin:/usr/lib/teTeX/bin:/usr/local/bin:/usr/local/sbin:/usr/bin:/usr/sbin
:/bin:/sbin:/usr/X11/bin:/usr/X11/sbin:/usr/games:/opt/Croquet-SDK/bin:/opt/MailScanner/bi
n:/opt/Maxima/bin:/opt/anomy-mailtools/bin:/opt/apache/bin:/opt/apache/sbin:/opt/bincimap/
bin:/opt/cbrowser/bin:/opt/clanlib06/bin:/opt/clanlib06/sbin:/opt/clanlib07/bin:/opt/clanl
ib07/sbin:/opt/clip/bin:/opt/clip/sbin:/opt/coda/bin:/opt/coda/sbin:/opt/dcc/bin:/opt/e16/
bin:/opt/e16/sbin:/opt/e17/bin:/opt/e17/sbin:/opt/gnome/bin:/opt/gnome/sbin:/opt/gnome2/bi
n:/opt/gnome2/sbin:/opt/mono/bin:/opt/mono/sbin:/opt/mysql41/bin:/opt/mysql50/bin:/opt/myt
htv/bin:/opt/mythtv/sbin:/opt/nagios/bin:/opt/nagios/sbin:/opt/nx/bin:/opt/pegasus/bin:/op
t/postgresql/bin:/opt/qcad/bin:/opt/qt33/bin:/opt/qt42/bin:/opt/root/bin:/opt/root/sbin:/o
pt/samba/bin:/opt/samba/sbin:/opt/schily/bin:/opt/snort/bin:/opt/squid/bin:/opt/squid/sbin
:/opt/thunderbird/bin:/opt/tomcat/bin:/opt/tomcat/sbin:/opt/unrealircd/bin:/opt/validator/
bin:/opt/wwwoffle/bin:/opt/wwwoffle/sbin:/opt/xfce4/bin:/opt/xfce4/sbin:/opt/xjdic/bin:/us
r/bin
[5-ERROR] New PATH: /ROCK/src.zd1211.1181951455.18437.4161569442/wrappers:/ROCK/build/ref0
603-TRUNK-x86-reference/ROCK/tools.chroot/bin:/usr/lib/teTeX/bin:/usr/local/bin:/usr/local
/sbin:/usr/bin:/usr/sbin:/bin:/sbin:/usr/X11/bin:/usr/X11/sbin:/usr/games:/opt/Croquet-SDK
/bin:/opt/MailScanner/bin:/opt/Maxima/bin:/opt/anomy-mailtools/bin:/opt/apache/bin:/opt/ap
ache/sbin:/opt/bincimap/bin:/opt/cbrowser/bin:/opt/clanlib06/bin:/opt/clanlib06/sbin:/opt/
clanlib07/bin:/opt/clanlib07/sbin:/opt/clip/bin:/opt/clip/sbin:/opt/coda/bin:/opt/coda/sbi
n:/opt/dcc/bin:/opt/e16/bin:/opt/e16/sbin:/opt/e17/bin:/opt/e17/sbin:/opt/gnome/bin:/opt/g
nome/sbin:/opt/gnome2/bin:/opt/gnome2/sbin:/opt/mono/bin:/opt/mono/sbin:/opt/mysql41/bin:/
opt/mysql50/bin:/opt/mythtv/bin:/opt/mythtv/sbin:/opt/nagios/bin:/opt/nagios/sbin:/opt/nx/
bin:/opt/pegasus/bin:/opt/postgresql/bin:/opt/qcad/bin:/opt/qt33/bin:/opt/qt42/bin:/opt/ro
ot/bin:/opt/root/sbin:/opt/samba/bin:/opt/samba/sbin:/opt/schily/bin:/opt/snort/bin:/opt/s
quid/bin:/opt/squid/sbin:/opt/thunderbird/bin:/opt/tomcat/bin:/opt/tomcat/sbin:/opt/unreal
ircd/bin:/opt/validator/bin:/opt/wwwoffle/bin:/opt/wwwoffle/sbin:/opt/xfce4/bin:/opt/xfce4
/sbin:/opt/xjdic/bin:/usr/bin
[5-ERROR] Insert: -O1
[5-ERROR] Insert: -pipe
[5-ERROR] Insert: -march=i486
[5-ERROR] Copy:   --version
[5-ERROR] Append: -s
[5-ERROR] New Command: gcc-42 -O1 -pipe -march=i486 --version -s
[5-ERROR] gcc-42 (GCC) 4.2.0
[5-ERROR] Copyright (C) 2007 Free Software Foundation, Inc.
[5-ERROR] This is free software; see the source for copying conditions.  There is NO
[5-ERROR] warranty; not even for MERCHANTABILITY or FITNESS FOR A PARTICULAR PURPOSE.
[5-ERROR] 
[5-ERROR] [ writing debug log to /ROCK/src.zd1211.1181951455.18437.4161569442/cmd_wrapper.
log ]
[5-ERROR] Running main build function 'build_this_package' ...
[5-ERROR] Extracting sf_zd1211_20050822_src.tar.bz2 (tar -v --use-compress-program=bzip2 -
xf) ... 
[5-ERROR] Fixing ownership and permissions ...
[5-ERROR] Removing CVS and .svn directories ...
[5-ERROR] Changeing into /ROCK/src.zd1211.1181951455.18437.4161569442/zd1211 ...
[5-ERROR] Apply patch /ROCK/package/daja77/zd1211/zd1211-makefile.patch ...
[5-ERROR] patching file Makefile
[5-ERROR] Creating /usr/<..> if required ...
[5-ERROR] cat /ROCK/loop/src.zd1211.1181951455.18437.4161569442/zd1211/src/zddevlist | awk
 -f /ROCK/loop/src.zd1211.1181951455.18437.4161569442/zd1211/src/zddevlist.awk > /ROCK/loo
p/src.zd1211.1181951455.18437.4161569442/zd1211/src/zddevlist.h
[5-ERROR] mkdir -p /ROCK/loop/src.zd1211.1181951455.18437.4161569442/zd1211/src/modules-2.
6.21.3-rock
[5-ERROR] (cd /ROCK/loop/src.zd1211.1181951455.18437.4161569442/zd1211/src/modules-2.6.21.
3-rock; \
[5-ERROR] 	  ln -sf /ROCK/loop/src.zd1211.1181951455.18437.4161569442/zd1211/src/Make
file; \
[5-ERROR] 	  for i in /ROCK/loop/src.zd1211.1181951455.18437.4161569442/zd1211/src/*.
c /ROCK/loop/src.zd1211.1181951455.18437.4161569442/zd1211/src/*.h; \
[5-ERROR] 	  do \
[5-ERROR] 	  ln -sf ${i}; \
[5-ERROR] 	  done; \
[5-ERROR] 	)
[5-ERROR] make V=0 -C /usr/src/linux SUBDIRS=/ROCK/loop/src.zd1211.1181951455.18437.416156
9442/zd1211/src/modules-2.6.21.3-rock modules
[5-ERROR] make[1]: Entering directory `/usr/src/linux-2.6.21.3-rock'
[5-ERROR] 
[5-ERROR]   WARNING: Symbol version dump /usr/src/linux-2.6.21.3-rock/Module.symvers
[5-ERROR]            is missing; modules will have no dependencies and modversions.
[5-ERROR] 
[5-ERROR]   CC [M]  /ROCK/loop/src.zd1211.1181951455.18437.4161569442/zd1211/src/modules-2
.6.21.3-rock/zd1205.o
[5-ERROR] /ROCK/loop/src.zd1211.1181951455.18437.4161569442/zd1211/src/modules-2.6.21.3-ro
ck/zd1205.c:28:26: error: linux/config.h: No such file or directory
[5-ERROR] /ROCK/loop/src.zd1211.1181951455.18437.4161569442/zd1211/src/modules-2.6.21.3-ro
ck/zd1205.c: In function 'zd1205_ioctl':
[5-ERROR] /ROCK/loop/src.zd1211.1181951455.18437.4161569442/zd1211/src/modules-2.6.21.3-ro
ck/zd1205.c:4438: warning: implicit declaration of function 'verify_area'
[5-ERROR] make[2]: *** [/ROCK/loop/src.zd1211.1181951455.18437.4161569442/zd1211/src/modul
es-2.6.21.3-rock/zd1205.o] Error 1
[5-ERROR] make[1]: *** [_module_/ROCK/loop/src.zd1211.1181951455.18437.4161569442/zd1211/s
rc/modules-2.6.21.3-rock] Error 2
[5-ERROR] make[1]: Leaving directory `/usr/src/linux-2.6.21.3-rock'
[5-ERROR] make: *** [all] Error 2
[5-ERROR] --- BUILD ERROR ---

[9-ERROR] INSERT = '-O1 -pipe -march=i486'
[9-ERROR] REMOVE = '-march=* -mcpu=* -O -O[0-9s] -g* -I/usr/local/include -I/usr/include'
[9-ERROR] APPEND = '-s'
[9-ERROR] FILTER = ''
[9-ERROR] Old PATH: /ROCK/src.zd1211.1181972994.21743.2938899655/wrappers:/ROCK/build/ref0
603-TRUNK-x86-reference/ROCK/tools.chroot/wrapper:/ROCK/build/ref0603-TRUNK-x86-reference/
ROCK/tools.chroot/bin:/usr/lib/teTeX/bin:/usr/local/bin:/usr/local/sbin:/usr/bin:/usr/sbin
:/bin:/sbin:/usr/X11/bin:/usr/X11/sbin:/usr/games:/opt/Croquet-SDK/bin:/opt/MailScanner/bi
n:/opt/Maxima/bin:/opt/anomy-mailtools/bin:/opt/apache/bin:/opt/apache/sbin:/opt/bincimap/
bin:/opt/cbrowser/bin:/opt/clanlib06/bin:/opt/clanlib06/sbin:/opt/clanlib07/bin:/opt/clanl
ib07/sbin:/opt/clip/bin:/opt/clip/sbin:/opt/coda/bin:/opt/coda/sbin:/opt/dcc/bin:/opt/e16/
bin:/opt/e16/sbin:/opt/e17/bin:/opt/e17/sbin:/opt/gnome/bin:/opt/gnome/sbin:/opt/gnome2/bi
n:/opt/gnome2/sbin:/opt/mono/bin:/opt/mono/sbin:/opt/mysql41/bin:/opt/mysql50/bin:/opt/myt
htv/bin:/opt/mythtv/sbin:/opt/nagios/bin:/opt/nagios/sbin:/opt/nx/bin:/opt/pegasus/bin:/op
t/postgresql/bin:/opt/qcad/bin:/opt/qt33/bin:/opt/qt42/bin:/opt/root/bin:/opt/root/sbin:/o
pt/samba/bin:/opt/samba/sbin:/opt/schily/bin:/opt/snort/bin:/opt/squid/bin:/opt/squid/sbin
:/opt/thunderbird/bin:/opt/tomcat/bin:/opt/tomcat/sbin:/opt/unrealircd/bin:/opt/validator/
bin:/opt/wwwoffle/bin:/opt/wwwoffle/sbin:/opt/xfce4/bin:/opt/xfce4/sbin:/opt/xjdic/bin:/us
r/bin
[9-ERROR] New PATH: /ROCK/src.zd1211.1181972994.21743.2938899655/wrappers:/ROCK/build/ref0
603-TRUNK-x86-reference/ROCK/tools.chroot/bin:/usr/lib/teTeX/bin:/usr/local/bin:/usr/local
/sbin:/usr/bin:/usr/sbin:/bin:/sbin:/usr/X11/bin:/usr/X11/sbin:/usr/games:/opt/Croquet-SDK
/bin:/opt/MailScanner/bin:/opt/Maxima/bin:/opt/anomy-mailtools/bin:/opt/apache/bin:/opt/ap
ache/sbin:/opt/bincimap/bin:/opt/cbrowser/bin:/opt/clanlib06/bin:/opt/clanlib06/sbin:/opt/
clanlib07/bin:/opt/clanlib07/sbin:/opt/clip/bin:/opt/clip/sbin:/opt/coda/bin:/opt/coda/sbi
n:/opt/dcc/bin:/opt/e16/bin:/opt/e16/sbin:/opt/e17/bin:/opt/e17/sbin:/opt/gnome/bin:/opt/g
nome/sbin:/opt/gnome2/bin:/opt/gnome2/sbin:/opt/mono/bin:/opt/mono/sbin:/opt/mysql41/bin:/
opt/mysql50/bin:/opt/mythtv/bin:/opt/mythtv/sbin:/opt/nagios/bin:/opt/nagios/sbin:/opt/nx/
bin:/opt/pegasus/bin:/opt/postgresql/bin:/opt/qcad/bin:/opt/qt33/bin:/opt/qt42/bin:/opt/ro
ot/bin:/opt/root/sbin:/opt/samba/bin:/opt/samba/sbin:/opt/schily/bin:/opt/snort/bin:/opt/s
quid/bin:/opt/squid/sbin:/opt/thunderbird/bin:/opt/tomcat/bin:/opt/tomcat/sbin:/opt/unreal
ircd/bin:/opt/validator/bin:/opt/wwwoffle/bin:/opt/wwwoffle/sbin:/opt/xfce4/bin:/opt/xfce4
/sbin:/opt/xjdic/bin:/usr/bin
[9-ERROR] Insert: -O1
[9-ERROR] Insert: -pipe
[9-ERROR] Insert: -march=i486
[9-ERROR] Copy:   --version
[9-ERROR] Append: -s
[9-ERROR] New Command: gcc-42 -O1 -pipe -march=i486 --version -s
[9-ERROR] gcc-42 (GCC) 4.2.0
[9-ERROR] Copyright (C) 2007 Free Software Foundation, Inc.
[9-ERROR] This is free software; see the source for copying conditions.  There is NO
[9-ERROR] warranty; not even for MERCHANTABILITY or FITNESS FOR A PARTICULAR PURPOSE.
[9-ERROR] 
[9-ERROR] [ writing debug log to /ROCK/src.zd1211.1181972994.21743.2938899655/cmd_wrapper.
log ]
[9-ERROR] Running main build function 'build_this_package' ...
[9-ERROR] Extracting sf_zd1211_20050822_src.tar.bz2 (tar -v --use-compress-program=bzip2 -
xf) ... 
[9-ERROR] Fixing ownership and permissions ...
[9-ERROR] Removing CVS and .svn directories ...
[9-ERROR] Changeing into /ROCK/src.zd1211.1181972994.21743.2938899655/zd1211 ...
[9-ERROR] Apply patch /ROCK/package/daja77/zd1211/zd1211-makefile.patch ...
[9-ERROR] patching file Makefile
[9-ERROR] Creating /usr/<..> if required ...
[9-ERROR] cat /ROCK/loop/src.zd1211.1181972994.21743.2938899655/zd1211/src/zddevlist | awk
 -f /ROCK/loop/src.zd1211.1181972994.21743.2938899655/zd1211/src/zddevlist.awk > /ROCK/loo
p/src.zd1211.1181972994.21743.2938899655/zd1211/src/zddevlist.h
[9-ERROR] mkdir -p /ROCK/loop/src.zd1211.1181972994.21743.2938899655/zd1211/src/modules-2.
6.21.3-rock
[9-ERROR] (cd /ROCK/loop/src.zd1211.1181972994.21743.2938899655/zd1211/src/modules-2.6.21.
3-rock; \
[9-ERROR] 	  ln -sf /ROCK/loop/src.zd1211.1181972994.21743.2938899655/zd1211/src/Make
file; \
[9-ERROR] 	  for i in /ROCK/loop/src.zd1211.1181972994.21743.2938899655/zd1211/src/*.
c /ROCK/loop/src.zd1211.1181972994.21743.2938899655/zd1211/src/*.h; \
[9-ERROR] 	  do \
[9-ERROR] 	  ln -sf ${i}; \
[9-ERROR] 	  done; \
[9-ERROR] 	)
[9-ERROR] make V=0 -C /usr/src/linux SUBDIRS=/ROCK/loop/src.zd1211.1181972994.21743.293889
9655/zd1211/src/modules-2.6.21.3-rock modules
[9-ERROR] make[1]: Entering directory `/usr/src/linux-2.6.21.3-rock'
[9-ERROR] 
[9-ERROR]   WARNING: Symbol version dump /usr/src/linux-2.6.21.3-rock/Module.symvers
[9-ERROR]            is missing; modules will have no dependencies and modversions.
[9-ERROR] 
[9-ERROR]   CC [M]  /ROCK/loop/src.zd1211.1181972994.21743.2938899655/zd1211/src/modules-2
.6.21.3-rock/zd1205.o
[9-ERROR] /ROCK/loop/src.zd1211.1181972994.21743.2938899655/zd1211/src/modules-2.6.21.3-ro
ck/zd1205.c:28:26: error: linux/config.h: No such file or directory
[9-ERROR] /ROCK/loop/src.zd1211.1181972994.21743.2938899655/zd1211/src/modules-2.6.21.3-ro
ck/zd1205.c: In function 'zd1205_ioctl':
[9-ERROR] /ROCK/loop/src.zd1211.1181972994.21743.2938899655/zd1211/src/modules-2.6.21.3-ro
ck/zd1205.c:4438: warning: implicit declaration of function 'verify_area'
[9-ERROR] make[2]: *** [/ROCK/loop/src.zd1211.1181972994.21743.2938899655/zd1211/src/modul
es-2.6.21.3-rock/zd1205.o] Error 1
[9-ERROR] make[1]: *** [_module_/ROCK/loop/src.zd1211.1181972994.21743.2938899655/zd1211/s
rc/modules-2.6.21.3-rock] Error 2
[9-ERROR] make[1]: Leaving directory `/usr/src/linux-2.6.21.3-rock'
[9-ERROR] make: *** [all] Error 2
[9-ERROR] --- BUILD ERROR ---