Package description for 'dsniff'

dsniff - a network auditing suite

 dsniff is a collection of tools for network auditing and penetration
 testing. dsniff, filesnarf, mailsnarf, msgsnarf, urlsnarf, and webspy
 passively monitor a network for interesting data (passwords, e-mail, files,
 etc.). arpspoof, dnsspoof, and macof facilitate the interception of network
 traffic normally unavailable to an attacker (e.g, due to layer-2
 switching). sshmitm and webmitm implement active monkey-in-the-middle
 attacks against redirected SSH and HTTPS sessions by exploiting weak
 bindings in ad-hoc PKI.
 NOTE: This version of the package was patched by Denis Ducamp to compile 
       with newer versions of the affected libraries. Not all binaries are 
       built though!

Various other information for package 'dsniff'   (Repository 'avm')

URL: http://monkey.org/~dugsong/dsniff/

Author: Dug Song <dugsong@monkey.org>
Maintainer: Andreas V. 'netrunner' Meier <avmeier@web.de>

License: GPL
Status: Beta
Version: 2.4b1

Download: http://www.groar.org/patch/ dsniff-2.4b1-sined-2.tar.bz2

Buildtime: 2905 (5) ERROR seconds (on reference hardware)
Buildtime: 2891 (9) ERROR seconds (on reference hardware)
Buildtime: 2910 (5) ERROR seconds (on reference hardware)
Buildtime: 2813 (9) ERROR seconds (on reference hardware)
Buildtime: 2832 (5) ERROR seconds (on reference hardware)
Buildtime: 2822 (9) ERROR seconds (on reference hardware)

ROCK Sources:  dsniff.cachedsniff.confdsniff.descdsniff.desktop

Error Logs

[5-ERROR] /usr/include/netinet/in.h:136: error: two or more data types in declaration spec
ifiers
[5-ERROR] /usr/include/netinet/in.h:136: error: two or more data types in declaration spec
ifiers
[5-ERROR] ./urlsnarf.c: In function 'process_http_request':
[5-ERROR] ./urlsnarf.c:152: warning: assignment makes pointer from integer without a cast
[5-ERROR] make: [urlsnarf.o] Error 1 (ignored)
[5-ERROR] gcc-42  -o urlsnarf urlsnarf.o base64.o buf.o pcaputil.o -lresolv -lnsl -lrpcsvc
  -L. -lmissing -L/usr/lib -lnids -L/usr/lib -lpcap -L/usr/lib -lnet
[5-ERROR] gcc-42: urlsnarf.o: No such file or directory
[5-ERROR] make: [urlsnarf] Error 1 (ignored)
[5-ERROR] gcc-42 -g -O2 -D_BSD_SOURCE  -DDSNIFF_LIBDIR=\"/usr/lib/\" -DLIBNET_VER=0 -I. -I
/usr/include -I/usr/include -I/usr/include -I/usr/include -I/usr/include -I/usr/X11R7/incl
ude -I./missing -c ./webmitm.c
[5-ERROR] In file included from ./webmitm.c:17:
[5-ERROR] /usr/include/netinet/in.h:136: error: two or more data types in declaration spec
ifiers
[5-ERROR] /usr/include/netinet/in.h:136: error: two or more data types in declaration spec
ifiers
[5-ERROR] ./webmitm.c:50: warning: built-in function 'csin' declared as non-function
[5-ERROR] make: [webmitm.o] Error 1 (ignored)
[5-ERROR] gcc-42  -o webmitm webmitm.o base64.o buf.o decode_http.o record.o -lresolv -lns
l -lrpcsvc  -L. -lmissing -L/usr/lib -lnet -L/usr/lib -ldb -L/usr/lib -lssl -lcrypto
[5-ERROR] gcc-42: webmitm.o: No such file or directory
[5-ERROR] gcc-42: record.o: No such file or directory
[5-ERROR] make: [webmitm] Error 1 (ignored)
[5-ERROR] gcc-42 -g -O2 -D_BSD_SOURCE  -DDSNIFF_LIBDIR=\"/usr/lib/\" -DLIBNET_VER=0 -I. -I
/usr/include -I/usr/include -I/usr/include -I/usr/include -I/usr/include -I/usr/X11R7/incl
ude -I./missing -c ./webspy.c
[5-ERROR] In file included from ./webspy.c:15:
[5-ERROR] /usr/include/netinet/in.h:136: error: two or more data types in declaration spec
ifiers
[5-ERROR] /usr/include/netinet/in.h:136: error: two or more data types in declaration spec
ifiers
[5-ERROR] ./webspy.c: In function 'process_http_request':
[5-ERROR] ./webspy.c:133: warning: assignment makes pointer from integer without a cast
[5-ERROR] make: [webspy.o] Error 1 (ignored)
[5-ERROR] gcc-42 -g -O2 -D_BSD_SOURCE  -DDSNIFF_LIBDIR=\"/usr/lib/\" -DLIBNET_VER=0 -I. -I
/usr/include -I/usr/include -I/usr/include -I/usr/include -I/usr/include -I/usr/X11R7/incl
ude -I./missing -c ./remote.c
[5-ERROR] gcc-42  -o webspy webspy.o base64.o buf.o remote.o -lresolv -lnsl -lrpcsvc  -L. 
-lmissing -L/usr/lib -lnids -L/usr/lib -lpcap -L/usr/lib -lnet -L/usr/X11R7/lib  -lSM -lIC
E -lXmu -lX11 
[5-ERROR] gcc-42: webspy.o: No such file or directory
[5-ERROR] make: [webspy] Error 1 (ignored)
[5-ERROR] test -d /usr/sbin || \
[5-ERROR] 	   /ROCK/build/ref0603-TRUNK-x86-reference/ROCK/tools.chroot/wrapper/insta
ll -c -d /usr/sbin
[5-ERROR] for file in arpspoof dnsspoof dsniff filesnarf macof mailsnarf msgsnarf sshmitm 
sshow tcpkill tcpnice  urlsnarf webmitm webspy ; do \
[5-ERROR] 	   /ROCK/build/ref0603-TRUNK-x86-reference/ROCK/tools.chroot/wrapper/insta
ll -c -m 755 $file /usr/sbin; \
[5-ERROR] 	done
[5-ERROR] install: cannot stat `arpspoof': No such file or directory
[5-ERROR] install: cannot stat `dnsspoof': No such file or directory
[5-ERROR] install: cannot stat `dsniff': No such file or directory
[5-ERROR] install: cannot stat `filesnarf': No such file or directory
[5-ERROR] install: cannot stat `macof': No such file or directory
[5-ERROR] install: cannot stat `mailsnarf': No such file or directory
[5-ERROR] install: cannot stat `msgsnarf': No such file or directory
[5-ERROR] install: cannot stat `sshmitm': No such file or directory
[5-ERROR] install: cannot stat `sshow': No such file or directory
[5-ERROR] install: cannot stat `tcpkill': No such file or directory
[5-ERROR] install: cannot stat `tcpnice': No such file or directory
[5-ERROR] install: cannot stat `urlsnarf': No such file or directory
[5-ERROR] install: cannot stat `webmitm': No such file or directory
[5-ERROR] install: cannot stat `webspy': No such file or directory
[5-ERROR] make: *** [install] Error 1
[5-ERROR] --- BUILD ERROR ---

[9-ERROR] /usr/include/netinet/in.h:136: error: two or more data types in declaration spec
ifiers
[9-ERROR] /usr/include/netinet/in.h:136: error: two or more data types in declaration spec
ifiers
[9-ERROR] ./urlsnarf.c: In function 'process_http_request':
[9-ERROR] ./urlsnarf.c:152: warning: assignment makes pointer from integer without a cast
[9-ERROR] make: [urlsnarf.o] Error 1 (ignored)
[9-ERROR] gcc-42  -o urlsnarf urlsnarf.o base64.o buf.o pcaputil.o -lresolv -lnsl -lrpcsvc
  -L. -lmissing -L/usr/lib -lnids -L/usr/lib -lpcap -L/usr/lib -lnet
[9-ERROR] gcc-42: urlsnarf.o: No such file or directory
[9-ERROR] make: [urlsnarf] Error 1 (ignored)
[9-ERROR] gcc-42 -g -O2 -D_BSD_SOURCE  -DDSNIFF_LIBDIR=\"/usr/lib/\" -DLIBNET_VER=0 -I. -I
/usr/include -I/usr/include -I/usr/include -I/usr/include -I/usr/include -I/usr/X11R7/incl
ude -I./missing -c ./webmitm.c
[9-ERROR] In file included from ./webmitm.c:17:
[9-ERROR] /usr/include/netinet/in.h:136: error: two or more data types in declaration spec
ifiers
[9-ERROR] /usr/include/netinet/in.h:136: error: two or more data types in declaration spec
ifiers
[9-ERROR] ./webmitm.c:50: warning: built-in function 'csin' declared as non-function
[9-ERROR] make: [webmitm.o] Error 1 (ignored)
[9-ERROR] gcc-42  -o webmitm webmitm.o base64.o buf.o decode_http.o record.o -lresolv -lns
l -lrpcsvc  -L. -lmissing -L/usr/lib -lnet -L/usr/lib -ldb -L/usr/lib -lssl -lcrypto
[9-ERROR] gcc-42: webmitm.o: No such file or directory
[9-ERROR] gcc-42: record.o: No such file or directory
[9-ERROR] make: [webmitm] Error 1 (ignored)
[9-ERROR] gcc-42 -g -O2 -D_BSD_SOURCE  -DDSNIFF_LIBDIR=\"/usr/lib/\" -DLIBNET_VER=0 -I. -I
/usr/include -I/usr/include -I/usr/include -I/usr/include -I/usr/include -I/usr/X11R7/incl
ude -I./missing -c ./webspy.c
[9-ERROR] In file included from ./webspy.c:15:
[9-ERROR] /usr/include/netinet/in.h:136: error: two or more data types in declaration spec
ifiers
[9-ERROR] /usr/include/netinet/in.h:136: error: two or more data types in declaration spec
ifiers
[9-ERROR] ./webspy.c: In function 'process_http_request':
[9-ERROR] ./webspy.c:133: warning: assignment makes pointer from integer without a cast
[9-ERROR] make: [webspy.o] Error 1 (ignored)
[9-ERROR] gcc-42 -g -O2 -D_BSD_SOURCE  -DDSNIFF_LIBDIR=\"/usr/lib/\" -DLIBNET_VER=0 -I. -I
/usr/include -I/usr/include -I/usr/include -I/usr/include -I/usr/include -I/usr/X11R7/incl
ude -I./missing -c ./remote.c
[9-ERROR] gcc-42  -o webspy webspy.o base64.o buf.o remote.o -lresolv -lnsl -lrpcsvc  -L. 
-lmissing -L/usr/lib -lnids -L/usr/lib -lpcap -L/usr/lib -lnet -L/usr/X11R7/lib  -lSM -lIC
E -lXmu -lX11 
[9-ERROR] gcc-42: webspy.o: No such file or directory
[9-ERROR] make: [webspy] Error 1 (ignored)
[9-ERROR] test -d /usr/sbin || \
[9-ERROR] 	   /ROCK/build/ref0603-TRUNK-x86-reference/ROCK/tools.chroot/wrapper/insta
ll -c -d /usr/sbin
[9-ERROR] for file in arpspoof dnsspoof dsniff filesnarf macof mailsnarf msgsnarf sshmitm 
sshow tcpkill tcpnice  urlsnarf webmitm webspy ; do \
[9-ERROR] 	   /ROCK/build/ref0603-TRUNK-x86-reference/ROCK/tools.chroot/wrapper/insta
ll -c -m 755 $file /usr/sbin; \
[9-ERROR] 	done
[9-ERROR] install: cannot stat `arpspoof': No such file or directory
[9-ERROR] install: cannot stat `dnsspoof': No such file or directory
[9-ERROR] install: cannot stat `dsniff': No such file or directory
[9-ERROR] install: cannot stat `filesnarf': No such file or directory
[9-ERROR] install: cannot stat `macof': No such file or directory
[9-ERROR] install: cannot stat `mailsnarf': No such file or directory
[9-ERROR] install: cannot stat `msgsnarf': No such file or directory
[9-ERROR] install: cannot stat `sshmitm': No such file or directory
[9-ERROR] install: cannot stat `sshow': No such file or directory
[9-ERROR] install: cannot stat `tcpkill': No such file or directory
[9-ERROR] install: cannot stat `tcpnice': No such file or directory
[9-ERROR] install: cannot stat `urlsnarf': No such file or directory
[9-ERROR] install: cannot stat `webmitm': No such file or directory
[9-ERROR] install: cannot stat `webspy': No such file or directory
[9-ERROR] make: *** [install] Error 1
[9-ERROR] --- BUILD ERROR ---