Package description for 'krusader'

Twin-panel file manger for KDE 3.

 Krusader is an advanced twin-panel
 (commander-style) file-manager for KDE 3.x, but
 with many extras. It provides all the
 file-management features you could possibly want.
 It also features extensive archive handling,
 mounted filesystem support, FTP, an advanced
 search module, a text viewer/editor, directory
 synchronization, support for file content
 comparisons, powerful batch renaming, and much
 more. It supports the following archive formats:
 tar, zip, bzip2, gzip, rar, ace, arj, and rpm. It
 can also handle other KIOSlaves such as smb:// or
 fish://.

Various other information for package 'krusader'   (Repository 'avm')

URL: http://krusader.sourceforge.net/

Author: Shie Erlich <krusader [at] users [dot] sourceforge [dot] net>
Maintainer: Andreas V. 'netrunner' Meier <avmeier@web.de>

License: GPL
Status: Beta
Version: 1.70.0

Download: http://dl.sourceforge.net/krusader/ krusader-1.70.0.tar.gz

Buildtime: 4753 (5) ERROR seconds (on reference hardware)
Buildtime: 4700 (9) ERROR seconds (on reference hardware)
Buildtime: 4749 (5) ERROR seconds (on reference hardware)
Buildtime: 4573 (9) ERROR seconds (on reference hardware)
Buildtime: 4617 (5) ERROR seconds (on reference hardware)
Buildtime: 4607 (9) ERROR seconds (on reference hardware)

ROCK Sources:  krusader.cachekrusader.confkrusader.desc

Error Logs

[5-ERROR]   kde_includes:         /usr/include
[5-ERROR]   kde_libraries:        /usr/lib
[5-ERROR]   kde_locale:           /usr/share/locale
[5-ERROR]   qt_libraries:         /opt/qt33/lib
[5-ERROR]   qt_includes:          /opt/qt33/include
[5-ERROR]   KDEDIR:               /usr
[5-ERROR]   QTDIR:                /opt/qt33
[5-ERROR]   Install path:         /usr/bin
[5-ERROR]   krusader version:     1.70.0
[5-ERROR]   krusader binary:      /usr/bin/krusader     (after 'make install')
[5-ERROR] 
[5-ERROR] NOTICE:  Since the KJSEmbed-headers are not found Krusader will be build without
 JS support
[5-ERROR] 
[5-ERROR] Good - your configure finished. Start make now
[5-ERROR] 
[5-ERROR] make  all-recursive
[5-ERROR] make[1]: Entering directory `/ROCK/loop/src.krusader.1181959130.25861.1414180272
/krusader-1.70.0'
[5-ERROR] Making all in krusader
[5-ERROR] make[2]: Entering directory `/ROCK/loop/src.krusader.1181959130.25861.1414180272
/krusader-1.70.0/krusader'
[5-ERROR] Making all in BookMan
[5-ERROR] make[3]: Entering directory `/ROCK/loop/src.krusader.1181959130.25861.1414180272
/krusader-1.70.0/krusader/BookMan'
[5-ERROR] /opt/qt33/bin/moc ./krbookmark.h -o krbookmark.moc
[5-ERROR] if g++-42 -DHAVE_CONFIG_H -I. -I. -I../.. -I/opt/qt33/include -I/usr/X11R7/inclu
de   -DQT_THREAD_SUPPORT  -D_REENTRANT -D_LARGEFILE64_SOURCE -DKDE_NO_COMPAT -DQT_NO_ASCII
_CAST  -Wnon-virtual-dtor -Wno-long-long -Wundef -ansi -D_XOPEN_SOURCE=500 -D_BSD_SOURCE -
Wcast-align -Wconversion -Wchar-subscripts -Wall -W -Wpointer-arith -Wwrite-strings -DNDEB
UG -DNO_DEBUG -O2 -Wformat-security -Wmissing-format-attribute -fno-exceptions -fno-check-
new -fno-common  -MT krbookmark.o -MD -MP -MF ".deps/krbookmark.Tpo" \
[5-ERROR] 	  -c -o krbookmark.o `test -f 'krbookmark.cpp' || echo './'`krbookmark.cpp
; \
[5-ERROR] 	then mv -f ".deps/krbookmark.Tpo" ".deps/krbookmark.Po"; \
[5-ERROR] 	else rm -f ".deps/krbookmark.Tpo"; exit 1; \
[5-ERROR] 	fi
[5-ERROR] /opt/qt33/bin/moc ./krbookmarkbutton.h -o krbookmarkbutton.moc
[5-ERROR] if g++-42 -DHAVE_CONFIG_H -I. -I. -I../.. -I/opt/qt33/include -I/usr/X11R7/inclu
de   -DQT_THREAD_SUPPORT  -D_REENTRANT -D_LARGEFILE64_SOURCE -DKDE_NO_COMPAT -DQT_NO_ASCII
_CAST  -Wnon-virtual-dtor -Wno-long-long -Wundef -ansi -D_XOPEN_SOURCE=500 -D_BSD_SOURCE -
Wcast-align -Wconversion -Wchar-subscripts -Wall -W -Wpointer-arith -Wwrite-strings -DNDEB
UG -DNO_DEBUG -O2 -Wformat-security -Wmissing-format-attribute -fno-exceptions -fno-check-
new -fno-common  -MT krbookmarkbutton.o -MD -MP -MF ".deps/krbookmarkbutton.Tpo" \
[5-ERROR] 	  -c -o krbookmarkbutton.o `test -f 'krbookmarkbutton.cpp' || echo './'`kr
bookmarkbutton.cpp; \
[5-ERROR] 	then mv -f ".deps/krbookmarkbutton.Tpo" ".deps/krbookmarkbutton.Po"; \
[5-ERROR] 	else rm -f ".deps/krbookmarkbutton.Tpo"; exit 1; \
[5-ERROR] 	fi
[5-ERROR] /opt/qt33/bin/moc ./krbookmarkhandler.h -o krbookmarkhandler.moc
[5-ERROR] if g++-42 -DHAVE_CONFIG_H -I. -I. -I../.. -I/opt/qt33/include -I/usr/X11R7/inclu
de   -DQT_THREAD_SUPPORT  -D_REENTRANT -D_LARGEFILE64_SOURCE -DKDE_NO_COMPAT -DQT_NO_ASCII
_CAST  -Wnon-virtual-dtor -Wno-long-long -Wundef -ansi -D_XOPEN_SOURCE=500 -D_BSD_SOURCE -
Wcast-align -Wconversion -Wchar-subscripts -Wall -W -Wpointer-arith -Wwrite-strings -DNDEB
UG -DNO_DEBUG -O2 -Wformat-security -Wmissing-format-attribute -fno-exceptions -fno-check-
new -fno-common  -MT krbookmarkhandler.o -MD -MP -MF ".deps/krbookmarkhandler.Tpo" \
[5-ERROR] 	  -c -o krbookmarkhandler.o `test -f 'krbookmarkhandler.cpp' || echo './'`
krbookmarkhandler.cpp; \
[5-ERROR] 	then mv -f ".deps/krbookmarkhandler.Tpo" ".deps/krbookmarkhandler.Po"; \
[5-ERROR] 	else rm -f ".deps/krbookmarkhandler.Tpo"; exit 1; \
[5-ERROR] 	fi
[5-ERROR] In file included from kraddbookmarkdlg.h:5,
[5-ERROR]                  from krbookmarkhandler.cpp:2:
[5-ERROR] ../VFS/vfs.h:137: error: invalid pure specifier (only `= 0' is allowed) before '
;' token
[5-ERROR] make[3]: *** [krbookmarkhandler.o] Error 1
[5-ERROR] make[3]: Leaving directory `/ROCK/loop/src.krusader.1181959130.25861.1414180272/
krusader-1.70.0/krusader/BookMan'
[5-ERROR] make[2]: *** [all-recursive] Error 1
[5-ERROR] make[2]: Leaving directory `/ROCK/loop/src.krusader.1181959130.25861.1414180272/
krusader-1.70.0/krusader'
[5-ERROR] make[1]: *** [all-recursive] Error 1
[5-ERROR] make[1]: Leaving directory `/ROCK/loop/src.krusader.1181959130.25861.1414180272/
krusader-1.70.0'
[5-ERROR] make: *** [all] Error 2
[5-ERROR] --- BUILD ERROR ---

[9-ERROR]   kde_includes:         /usr/include
[9-ERROR]   kde_libraries:        /usr/lib
[9-ERROR]   kde_locale:           /usr/share/locale
[9-ERROR]   qt_libraries:         /opt/qt33/lib
[9-ERROR]   qt_includes:          /opt/qt33/include
[9-ERROR]   KDEDIR:               /usr
[9-ERROR]   QTDIR:                /opt/qt33
[9-ERROR]   Install path:         /usr/bin
[9-ERROR]   krusader version:     1.70.0
[9-ERROR]   krusader binary:      /usr/bin/krusader     (after 'make install')
[9-ERROR] 
[9-ERROR] NOTICE:  Since the KJSEmbed-headers are not found Krusader will be build without
 JS support
[9-ERROR] 
[9-ERROR] Good - your configure finished. Start make now
[9-ERROR] 
[9-ERROR] make  all-recursive
[9-ERROR] make[1]: Entering directory `/ROCK/loop/src.krusader.1181981052.648.3034343504/k
rusader-1.70.0'
[9-ERROR] Making all in krusader
[9-ERROR] make[2]: Entering directory `/ROCK/loop/src.krusader.1181981052.648.3034343504/k
rusader-1.70.0/krusader'
[9-ERROR] Making all in BookMan
[9-ERROR] make[3]: Entering directory `/ROCK/loop/src.krusader.1181981052.648.3034343504/k
rusader-1.70.0/krusader/BookMan'
[9-ERROR] /opt/qt33/bin/moc ./krbookmark.h -o krbookmark.moc
[9-ERROR] if g++-42 -DHAVE_CONFIG_H -I. -I. -I../.. -I/opt/qt33/include -I/usr/X11R7/inclu
de   -DQT_THREAD_SUPPORT  -D_REENTRANT -D_LARGEFILE64_SOURCE -DKDE_NO_COMPAT -DQT_NO_ASCII
_CAST  -Wnon-virtual-dtor -Wno-long-long -Wundef -ansi -D_XOPEN_SOURCE=500 -D_BSD_SOURCE -
Wcast-align -Wconversion -Wchar-subscripts -Wall -W -Wpointer-arith -Wwrite-strings -DNDEB
UG -DNO_DEBUG -O2 -Wformat-security -Wmissing-format-attribute -fno-exceptions -fno-check-
new -fno-common  -MT krbookmark.o -MD -MP -MF ".deps/krbookmark.Tpo" \
[9-ERROR] 	  -c -o krbookmark.o `test -f 'krbookmark.cpp' || echo './'`krbookmark.cpp
; \
[9-ERROR] 	then mv -f ".deps/krbookmark.Tpo" ".deps/krbookmark.Po"; \
[9-ERROR] 	else rm -f ".deps/krbookmark.Tpo"; exit 1; \
[9-ERROR] 	fi
[9-ERROR] /opt/qt33/bin/moc ./krbookmarkbutton.h -o krbookmarkbutton.moc
[9-ERROR] if g++-42 -DHAVE_CONFIG_H -I. -I. -I../.. -I/opt/qt33/include -I/usr/X11R7/inclu
de   -DQT_THREAD_SUPPORT  -D_REENTRANT -D_LARGEFILE64_SOURCE -DKDE_NO_COMPAT -DQT_NO_ASCII
_CAST  -Wnon-virtual-dtor -Wno-long-long -Wundef -ansi -D_XOPEN_SOURCE=500 -D_BSD_SOURCE -
Wcast-align -Wconversion -Wchar-subscripts -Wall -W -Wpointer-arith -Wwrite-strings -DNDEB
UG -DNO_DEBUG -O2 -Wformat-security -Wmissing-format-attribute -fno-exceptions -fno-check-
new -fno-common  -MT krbookmarkbutton.o -MD -MP -MF ".deps/krbookmarkbutton.Tpo" \
[9-ERROR] 	  -c -o krbookmarkbutton.o `test -f 'krbookmarkbutton.cpp' || echo './'`kr
bookmarkbutton.cpp; \
[9-ERROR] 	then mv -f ".deps/krbookmarkbutton.Tpo" ".deps/krbookmarkbutton.Po"; \
[9-ERROR] 	else rm -f ".deps/krbookmarkbutton.Tpo"; exit 1; \
[9-ERROR] 	fi
[9-ERROR] /opt/qt33/bin/moc ./krbookmarkhandler.h -o krbookmarkhandler.moc
[9-ERROR] if g++-42 -DHAVE_CONFIG_H -I. -I. -I../.. -I/opt/qt33/include -I/usr/X11R7/inclu
de   -DQT_THREAD_SUPPORT  -D_REENTRANT -D_LARGEFILE64_SOURCE -DKDE_NO_COMPAT -DQT_NO_ASCII
_CAST  -Wnon-virtual-dtor -Wno-long-long -Wundef -ansi -D_XOPEN_SOURCE=500 -D_BSD_SOURCE -
Wcast-align -Wconversion -Wchar-subscripts -Wall -W -Wpointer-arith -Wwrite-strings -DNDEB
UG -DNO_DEBUG -O2 -Wformat-security -Wmissing-format-attribute -fno-exceptions -fno-check-
new -fno-common  -MT krbookmarkhandler.o -MD -MP -MF ".deps/krbookmarkhandler.Tpo" \
[9-ERROR] 	  -c -o krbookmarkhandler.o `test -f 'krbookmarkhandler.cpp' || echo './'`
krbookmarkhandler.cpp; \
[9-ERROR] 	then mv -f ".deps/krbookmarkhandler.Tpo" ".deps/krbookmarkhandler.Po"; \
[9-ERROR] 	else rm -f ".deps/krbookmarkhandler.Tpo"; exit 1; \
[9-ERROR] 	fi
[9-ERROR] In file included from kraddbookmarkdlg.h:5,
[9-ERROR]                  from krbookmarkhandler.cpp:2:
[9-ERROR] ../VFS/vfs.h:137: error: invalid pure specifier (only `= 0' is allowed) before '
;' token
[9-ERROR] make[3]: *** [krbookmarkhandler.o] Error 1
[9-ERROR] make[3]: Leaving directory `/ROCK/loop/src.krusader.1181981052.648.3034343504/kr
usader-1.70.0/krusader/BookMan'
[9-ERROR] make[2]: *** [all-recursive] Error 1
[9-ERROR] make[2]: Leaving directory `/ROCK/loop/src.krusader.1181981052.648.3034343504/kr
usader-1.70.0/krusader'
[9-ERROR] make[1]: *** [all-recursive] Error 1
[9-ERROR] make[1]: Leaving directory `/ROCK/loop/src.krusader.1181981052.648.3034343504/kr
usader-1.70.0'
[9-ERROR] make: *** [all] Error 2
[9-ERROR] --- BUILD ERROR ---