Package description for 'superkaramba'

A tool for interactive eye-candy on your KDE desktop

 Theme writers create themes, or text files that define their widget.
 Then, they can optionally add python scripting to make their widget
 interactive. The possibilities are endless! 

 Here are just some examples of the things that can be done: 
 - Display system information such as CPU Usage, MP3 playing, etc.
 - Create cool custom toolbars that work any way imaginable
 - Create little games or virtual pets that live on your desktop
 - Display information from the internet, such as weather and headlines

Various other information for package 'superkaramba'   (Repository 'public')

URL: http://netdragon.sourceforge.net/

Author: Hans Karlsson <karlsson.h@home.se> {Original Karamba Author}
Author: Adam Geitgey <adam@rootnode.org> {Primary Author}
Maintainer: The ROCK Linux Project

License: GPL
Status: Beta
Version: 0.35

Download: http://dl.sourceforge.net/sourceforge/netdragon/ superkaramba-0.35.tar.gz

Buildtime: 7709 (5) ERROR seconds (on reference hardware)
Buildtime: 7921 (9) ERROR seconds (on reference hardware)
Buildtime: 7740 (5) ERROR seconds (on reference hardware)
Buildtime: 7717 (9) ERROR seconds (on reference hardware)
Buildtime: 7753 (5) ERROR seconds (on reference hardware)
Buildtime: 7598 (9) ERROR seconds (on reference hardware)

ROCK Sources:  python-2.4.patchsuperkaramba.cachesuperkaramba.confsuperkaramba.desc

Error Logs

[5-ERROR] cd .. && perl admin/am_edit po/Makefile.in
[5-ERROR] cd .. && /bin/sh ./config.status po/Makefile 
[5-ERROR] config.status: creating po/Makefile
[5-ERROR] make[2]: Leaving directory `/ROCK/loop/src.superkaramba.1181946182.10474.4092432
155/superkaramba-0.35/po'
[5-ERROR] make[2]: Entering directory `/ROCK/loop/src.superkaramba.1181946182.10474.409243
2155/superkaramba-0.35/po'
[5-ERROR] make[2]: Nothing to be done for `all'.
[5-ERROR] make[2]: Leaving directory `/ROCK/loop/src.superkaramba.1181946182.10474.4092432
155/superkaramba-0.35/po'
[5-ERROR] Making all in src
[5-ERROR] make[2]: Entering directory `/ROCK/loop/src.superkaramba.1181946182.10474.409243
2155/superkaramba-0.35/src'
[5-ERROR] cd .. && \
[5-ERROR] 	  /bin/sh /ROCK/src.superkaramba.1181946182.10474.4092432155/superkaramba-
0.35/admin/missing --run automake-1.7 --gnu  src/Makefile
[5-ERROR] cd .. && perl admin/am_edit src/Makefile.in
[5-ERROR] cd .. && /bin/sh ./config.status src/Makefile depfiles
[5-ERROR] config.status: creating src/Makefile
[5-ERROR] config.status: executing depfiles commands
[5-ERROR] make[2]: Leaving directory `/ROCK/loop/src.superkaramba.1181946182.10474.4092432
155/superkaramba-0.35/src'
[5-ERROR] make[2]: Entering directory `/ROCK/loop/src.superkaramba.1181946182.10474.409243
2155/superkaramba-0.35/src'
[5-ERROR] make[3]: Entering directory `/ROCK/loop/src.superkaramba.1181946182.10474.409243
2155/superkaramba-0.35/src'
[5-ERROR] /usr/bin/dcopidl ./dcopinterface.h > dcopinterface.kidl || ( rm -f dcopinterface
.kidl ; /bin/false )
[5-ERROR] /usr/bin/dcopidl2cpp --c++-suffix cpp --no-signals --no-skel dcopinterface.kidl
[5-ERROR] if g++-42 -DHAVE_CONFIG_H -I. -I. -I.. -I/opt/qt33/include -I/usr/X11R7/include 
 -I/usr/include/xmms -I/opt/gnome/include/gtk-1.2 -I/opt/gnome/include/glib-1.2 -I/opt/gno
me/lib/glib/include -I/usr/X11R7/include   -DQT_THREAD_SUPPORT  -D_REENTRANT  -Wnon-virtua
l-dtor -Wno-long-long -Wundef -pedantic -W -Wpointer-arith -Wmissing-prototypes -ansi -D_X
OPEN_SOURCE=500 -D_BSD_SOURCE -Wcast-align -Wconversion -DNDEBUG -DNO_DEBUG -O2 -fno-excep
tions -fno-check-new  -MT main.o -MD -MP -MF ".deps/main.Tpo" \
[5-ERROR] 	  -c -o main.o `test -f 'main.cpp' || echo './'`main.cpp; \
[5-ERROR] 	then mv -f ".deps/main.Tpo" ".deps/main.Po"; \
[5-ERROR] 	else rm -f ".deps/main.Tpo"; exit 1; \
[5-ERROR] 	fi
[5-ERROR] cc1plus: warning: command line option "-Wmissing-prototypes" is valid for Ada/C/
ObjC but not for C++
[5-ERROR] In file included from main.cpp:5:
[5-ERROR] ./karambaapp.h:14:20: error: Python.h: No such file or directory
[5-ERROR] In file included from main.cpp:19:
[5-ERROR] karamba.h:8:20: error: Python.h: No such file or directory
[5-ERROR] In file included from main.cpp:22:
[5-ERROR] karamba_python.h:44: error: ISO C++ forbids declaration of 'PyObject' with no ty
pe
[5-ERROR] karamba_python.h:44: error: expected ';' before '*' token
[5-ERROR] karamba_python.h:45: error: ISO C++ forbids declaration of 'PyObject' with no ty
pe
[5-ERROR] karamba_python.h:45: error: expected ';' before '*' token
[5-ERROR] karamba_python.h:46: error: ISO C++ forbids declaration of 'PyThreadState' with 
no type
[5-ERROR] karamba_python.h:46: error: expected ';' before '*' token
[5-ERROR] karamba_python.h:48: error: 'PyThreadState' has not been declared
[5-ERROR] karamba_python.h:49: error: ISO C++ forbids declaration of 'PyObject' with no ty
pe
[5-ERROR] karamba_python.h:49: error: expected ';' before '*' token
[5-ERROR] karamba_python.h:50: error: 'PyThreadState' has not been declared
[5-ERROR] karamba_python.h:51: error: 'PyObject' has not been declared
[5-ERROR] make[3]: *** [main.o] Error 1
[5-ERROR] make[3]: Leaving directory `/ROCK/loop/src.superkaramba.1181946182.10474.4092432
155/superkaramba-0.35/src'
[5-ERROR] make[2]: *** [all-recursive] Error 1
[5-ERROR] make[2]: Leaving directory `/ROCK/loop/src.superkaramba.1181946182.10474.4092432
155/superkaramba-0.35/src'
[5-ERROR] make[1]: *** [all-recursive] Error 1
[5-ERROR] make[1]: Leaving directory `/ROCK/loop/src.superkaramba.1181946182.10474.4092432
155/superkaramba-0.35'
[5-ERROR] make: *** [all] Error 2
[5-ERROR] --- BUILD ERROR ---

[9-ERROR] cd .. && perl admin/am_edit po/Makefile.in
[9-ERROR] cd .. && /bin/sh ./config.status po/Makefile 
[9-ERROR] config.status: creating po/Makefile
[9-ERROR] make[2]: Leaving directory `/ROCK/loop/src.superkaramba.1181967036.2555.33070083
18/superkaramba-0.35/po'
[9-ERROR] make[2]: Entering directory `/ROCK/loop/src.superkaramba.1181967036.2555.3307008
318/superkaramba-0.35/po'
[9-ERROR] make[2]: Nothing to be done for `all'.
[9-ERROR] make[2]: Leaving directory `/ROCK/loop/src.superkaramba.1181967036.2555.33070083
18/superkaramba-0.35/po'
[9-ERROR] Making all in src
[9-ERROR] make[2]: Entering directory `/ROCK/loop/src.superkaramba.1181967036.2555.3307008
318/superkaramba-0.35/src'
[9-ERROR] cd .. && \
[9-ERROR] 	  /bin/sh /ROCK/src.superkaramba.1181967036.2555.3307008318/superkaramba-0
.35/admin/missing --run automake-1.7 --gnu  src/Makefile
[9-ERROR] cd .. && perl admin/am_edit src/Makefile.in
[9-ERROR] cd .. && /bin/sh ./config.status src/Makefile depfiles
[9-ERROR] config.status: creating src/Makefile
[9-ERROR] config.status: executing depfiles commands
[9-ERROR] make[2]: Leaving directory `/ROCK/loop/src.superkaramba.1181967036.2555.33070083
18/superkaramba-0.35/src'
[9-ERROR] make[2]: Entering directory `/ROCK/loop/src.superkaramba.1181967036.2555.3307008
318/superkaramba-0.35/src'
[9-ERROR] make[3]: Entering directory `/ROCK/loop/src.superkaramba.1181967036.2555.3307008
318/superkaramba-0.35/src'
[9-ERROR] /usr/bin/dcopidl ./dcopinterface.h > dcopinterface.kidl || ( rm -f dcopinterface
.kidl ; /bin/false )
[9-ERROR] /usr/bin/dcopidl2cpp --c++-suffix cpp --no-signals --no-skel dcopinterface.kidl
[9-ERROR] if g++-42 -DHAVE_CONFIG_H -I. -I. -I.. -I/opt/qt33/include -I/usr/X11R7/include 
 -I/usr/include/xmms -I/opt/gnome/include/gtk-1.2 -I/opt/gnome/include/glib-1.2 -I/opt/gno
me/lib/glib/include -I/usr/X11R7/include   -DQT_THREAD_SUPPORT  -D_REENTRANT  -Wnon-virtua
l-dtor -Wno-long-long -Wundef -pedantic -W -Wpointer-arith -Wmissing-prototypes -ansi -D_X
OPEN_SOURCE=500 -D_BSD_SOURCE -Wcast-align -Wconversion -DNDEBUG -DNO_DEBUG -O2 -fno-excep
tions -fno-check-new  -MT main.o -MD -MP -MF ".deps/main.Tpo" \
[9-ERROR] 	  -c -o main.o `test -f 'main.cpp' || echo './'`main.cpp; \
[9-ERROR] 	then mv -f ".deps/main.Tpo" ".deps/main.Po"; \
[9-ERROR] 	else rm -f ".deps/main.Tpo"; exit 1; \
[9-ERROR] 	fi
[9-ERROR] cc1plus: warning: command line option "-Wmissing-prototypes" is valid for Ada/C/
ObjC but not for C++
[9-ERROR] In file included from main.cpp:5:
[9-ERROR] ./karambaapp.h:14:20: error: Python.h: No such file or directory
[9-ERROR] In file included from main.cpp:19:
[9-ERROR] karamba.h:8:20: error: Python.h: No such file or directory
[9-ERROR] In file included from main.cpp:22:
[9-ERROR] karamba_python.h:44: error: ISO C++ forbids declaration of 'PyObject' with no ty
pe
[9-ERROR] karamba_python.h:44: error: expected ';' before '*' token
[9-ERROR] karamba_python.h:45: error: ISO C++ forbids declaration of 'PyObject' with no ty
pe
[9-ERROR] karamba_python.h:45: error: expected ';' before '*' token
[9-ERROR] karamba_python.h:46: error: ISO C++ forbids declaration of 'PyThreadState' with 
no type
[9-ERROR] karamba_python.h:46: error: expected ';' before '*' token
[9-ERROR] karamba_python.h:48: error: 'PyThreadState' has not been declared
[9-ERROR] karamba_python.h:49: error: ISO C++ forbids declaration of 'PyObject' with no ty
pe
[9-ERROR] karamba_python.h:49: error: expected ';' before '*' token
[9-ERROR] karamba_python.h:50: error: 'PyThreadState' has not been declared
[9-ERROR] karamba_python.h:51: error: 'PyObject' has not been declared
[9-ERROR] make[3]: *** [main.o] Error 1
[9-ERROR] make[3]: Leaving directory `/ROCK/loop/src.superkaramba.1181967036.2555.33070083
18/superkaramba-0.35/src'
[9-ERROR] make[2]: *** [all-recursive] Error 1
[9-ERROR] make[2]: Leaving directory `/ROCK/loop/src.superkaramba.1181967036.2555.33070083
18/superkaramba-0.35/src'
[9-ERROR] make[1]: *** [all-recursive] Error 1
[9-ERROR] make[1]: Leaving directory `/ROCK/loop/src.superkaramba.1181967036.2555.33070083
18/superkaramba-0.35'
[9-ERROR] make: *** [all] Error 2
[9-ERROR] --- BUILD ERROR ---